Compiling Error

Hi all,

I`m just migrate small application (PB 11.2) to WPF. After successfully 
migrating, I`m try to run it, but the output say :

-------- Incremental build target: sample --------
Checking project settings...
Using Project p_sample_wpf
Generating XAML descendants...
   XAML generation complete.
Copying PowerBuilder resources to output directory...
   Copy complete.
Powerscript compile complete -- 0 error(s), 0 warning(s)
 Compile return code = 1.  Unable to continue build operation.
-------- Build request finished ---------

Why this error appear ? The message just only " Compile return code = 1. 
Unable to continue build operation"

Regard
DFS 

0
dfs
8/5/2010 12:25:00 PM
sybase.powerbuilder.net 284 articles. 0 followers. Follow

5 Replies
860 Views

Similar Articles

[PageSpeed] 56
Get it on Google Play
Get it on Apple App Store

Please pardon these basic checklist items first...
- Is the output directory read only or for some other reason do you not have 
rights to write there?
- Is another instance of the application already running from the output 
directory when you build?

-- 
John Strano - Sybase Technology Evangelist


"dfs" <half.lefthanded@yahoo.co.id> wrote in message 
news:4c5aad9c@forums-1-dub...
> Hi all,
>
> I`m just migrate small application (PB 11.2) to WPF. After successfully 
> migrating, I`m try to run it, but the output say :
>
> -------- Incremental build target: sample --------
> Checking project settings...
> Using Project p_sample_wpf
> Generating XAML descendants...
>   XAML generation complete.
> Copying PowerBuilder resources to output directory...
>   Copy complete.
> Powerscript compile complete -- 0 error(s), 0 warning(s)
> Compile return code = 1.  Unable to continue build operation.
> -------- Build request finished ---------
>
> Why this error appear ? The message just only " Compile return code = 1. 
> Unable to continue build operation"
>
> Regard
> DFS 


0
John
8/5/2010 1:35:08 PM
Hi John,

Thanks For your reply,

- I have a sufficient access to output folder.
- No, there is no running application. If the application running when I 
build it, the message is "  The process cannot
  access the file 'bin\Debug\xxx.exe' because it is being used by another 
process" .
- The message is just  "Compile return code = 1.  Unable to continue build 
operation"

Best Regard,
DFS

"John Strano[Sybase]" <nichtspamnonejohn@johnstrano.com> wrote in message 
news:4c5abe0c@forums-1-dub...
> Please pardon these basic checklist items first...
> - Is the output directory read only or for some other reason do you not 
> have rights to write there?
> - Is another instance of the application already running from the output 
> directory when you build?
>
> -- 
> John Strano - Sybase Technology Evangelist
>
>
> "dfs" <half.lefthanded@yahoo.co.id> wrote in message 
> news:4c5aad9c@forums-1-dub...
>> Hi all,
>>
>> I`m just migrate small application (PB 11.2) to WPF. After successfully 
>> migrating, I`m try to run it, but the output say :
>>
>> -------- Incremental build target: sample --------
>> Checking project settings...
>> Using Project p_sample_wpf
>> Generating XAML descendants...
>>   XAML generation complete.
>> Copying PowerBuilder resources to output directory...
>>   Copy complete.
>> Powerscript compile complete -- 0 error(s), 0 warning(s)
>> Compile return code = 1.  Unable to continue build operation.
>> -------- Build request finished ---------
>>
>> Why this error appear ? The message just only " Compile return code = 1. 
>> Unable to continue build operation"
>>
>> Regard
>> DFS
>
> 
0
dfs
8/5/2010 2:06:26 PM
In the microhelp, do you see "Build failed" or "Build cancelled"?

-- 
John Strano - Sybase Technology Evangelist


"dfs" <half.lefthanded@yahoo.co.id> wrote in message 
news:4c5ac562@forums-1-dub...
> Hi John,
>
> Thanks For your reply,
>
> - I have a sufficient access to output folder.
> - No, there is no running application. If the application running when I 
> build it, the message is "  The process cannot
>  access the file 'bin\Debug\xxx.exe' because it is being used by another 
> process" .
> - The message is just  "Compile return code = 1.  Unable to continue build 
> operation"
>
> Best Regard,
> DFS
>
> "John Strano[Sybase]" <nichtspamnonejohn@johnstrano.com> wrote in message 
> news:4c5abe0c@forums-1-dub...
>> Please pardon these basic checklist items first...
>> - Is the output directory read only or for some other reason do you not 
>> have rights to write there?
>> - Is another instance of the application already running from the output 
>> directory when you build?
>>
>> -- 
>> John Strano - Sybase Technology Evangelist
>>
>>
>> "dfs" <half.lefthanded@yahoo.co.id> wrote in message 
>> news:4c5aad9c@forums-1-dub...
>>> Hi all,
>>>
>>> I`m just migrate small application (PB 11.2) to WPF. After successfully 
>>> migrating, I`m try to run it, but the output say :
>>>
>>> -------- Incremental build target: sample --------
>>> Checking project settings...
>>> Using Project p_sample_wpf
>>> Generating XAML descendants...
>>>   XAML generation complete.
>>> Copying PowerBuilder resources to output directory...
>>>   Copy complete.
>>> Powerscript compile complete -- 0 error(s), 0 warning(s)
>>> Compile return code = 1.  Unable to continue build operation.
>>> -------- Build request finished ---------
>>>
>>> Why this error appear ? The message just only " Compile return code = 1. 
>>> Unable to continue build operation"
>>>
>>> Regard
>>> DFS
>>
>> 


0
John
8/5/2010 3:03:53 PM
Nope.


"John Strano[Sybase]" <nichtspamnonejohn@johnstrano.com> wrote in message 
news:4c5ad2d9$1@forums-1-dub...
> In the microhelp, do you see "Build failed" or "Build cancelled"?
>
> -- 
> John Strano - Sybase Technology Evangelist
>
>
> "dfs" <half.lefthanded@yahoo.co.id> wrote in message 
> news:4c5ac562@forums-1-dub...
>> Hi John,
>>
>> Thanks For your reply,
>>
>> - I have a sufficient access to output folder.
>> - No, there is no running application. If the application running when I 
>> build it, the message is "  The process cannot
>>  access the file 'bin\Debug\xxx.exe' because it is being used by another 
>> process" .
>> - The message is just  "Compile return code = 1.  Unable to continue 
>> build operation"
>>
>> Best Regard,
>> DFS
>>
>> "John Strano[Sybase]" <nichtspamnonejohn@johnstrano.com> wrote in message 
>> news:4c5abe0c@forums-1-dub...
>>> Please pardon these basic checklist items first...
>>> - Is the output directory read only or for some other reason do you not 
>>> have rights to write there?
>>> - Is another instance of the application already running from the output 
>>> directory when you build?
>>>
>>> -- 
>>> John Strano - Sybase Technology Evangelist
>>>
>>>
>>> "dfs" <half.lefthanded@yahoo.co.id> wrote in message 
>>> news:4c5aad9c@forums-1-dub...
>>>> Hi all,
>>>>
>>>> I`m just migrate small application (PB 11.2) to WPF. After successfully 
>>>> migrating, I`m try to run it, but the output say :
>>>>
>>>> -------- Incremental build target: sample --------
>>>> Checking project settings...
>>>> Using Project p_sample_wpf
>>>> Generating XAML descendants...
>>>>   XAML generation complete.
>>>> Copying PowerBuilder resources to output directory...
>>>>   Copy complete.
>>>> Powerscript compile complete -- 0 error(s), 0 warning(s)
>>>> Compile return code = 1.  Unable to continue build operation.
>>>> -------- Build request finished ---------
>>>>
>>>> Why this error appear ? The message just only " Compile return code = 
>>>> 1. Unable to continue build operation"
>>>>
>>>> Regard
>>>> DFS
>>>
>>>
>
> 
0
dfs
8/5/2010 3:17:36 PM
A last shot in the dark...

"Manually" delete the files in the output directory (careful not to delete 
source), then try again.

It may be time to open a case with tech support.

-- 
John Strano - Sybase Technology Evangelist


"dfs" <half.lefthanded@yahoo.co.id> wrote in message 
news:4c5ad610$1@forums-1-dub...
> Nope.
>
>
> "John Strano[Sybase]" <nichtspamnonejohn@johnstrano.com> wrote in message 
> news:4c5ad2d9$1@forums-1-dub...
>> In the microhelp, do you see "Build failed" or "Build cancelled"?
>>
>> -- 
>> John Strano - Sybase Technology Evangelist
>>
>>
>> "dfs" <half.lefthanded@yahoo.co.id> wrote in message 
>> news:4c5ac562@forums-1-dub...
>>> Hi John,
>>>
>>> Thanks For your reply,
>>>
>>> - I have a sufficient access to output folder.
>>> - No, there is no running application. If the application running when I 
>>> build it, the message is "  The process cannot
>>>  access the file 'bin\Debug\xxx.exe' because it is being used by another 
>>> process" .
>>> - The message is just  "Compile return code = 1.  Unable to continue 
>>> build operation"
>>>
>>> Best Regard,
>>> DFS
>>>
>>> "John Strano[Sybase]" <nichtspamnonejohn@johnstrano.com> wrote in 
>>> message news:4c5abe0c@forums-1-dub...
>>>> Please pardon these basic checklist items first...
>>>> - Is the output directory read only or for some other reason do you not 
>>>> have rights to write there?
>>>> - Is another instance of the application already running from the 
>>>> output directory when you build?
>>>>
>>>> -- 
>>>> John Strano - Sybase Technology Evangelist
>>>>
>>>>
>>>> "dfs" <half.lefthanded@yahoo.co.id> wrote in message 
>>>> news:4c5aad9c@forums-1-dub...
>>>>> Hi all,
>>>>>
>>>>> I`m just migrate small application (PB 11.2) to WPF. After 
>>>>> successfully migrating, I`m try to run it, but the output say :
>>>>>
>>>>> -------- Incremental build target: sample --------
>>>>> Checking project settings...
>>>>> Using Project p_sample_wpf
>>>>> Generating XAML descendants...
>>>>>   XAML generation complete.
>>>>> Copying PowerBuilder resources to output directory...
>>>>>   Copy complete.
>>>>> Powerscript compile complete -- 0 error(s), 0 warning(s)
>>>>> Compile return code = 1.  Unable to continue build operation.
>>>>> -------- Build request finished ---------
>>>>>
>>>>> Why this error appear ? The message just only " Compile return code = 
>>>>> 1. Unable to continue build operation"
>>>>>
>>>>> Regard
>>>>> DFS
>>>>
>>>>
>>
>> 


0
John
8/5/2010 6:04:34 PM
Reply:

Similar Artilces:

No errors before compile, errors after compile
I haven't seen anyone mention this problem so I'm hoping that it's something simple. When I compile my 6.5 ent app to exe & pbds I get errors that do not exist before the compile, and if I take a pbl (often not even the pbl with the offending code) and move it into the exe sometimes the errors go away. I have optimized and done a full rebuild. This obviously makes no sense I hope someone else has experienced this. The errors are usually null objects. My system is win95 with 128mb ram. Thanks in advance. Shawn Davis Shawn, One of the best things to do i...

asp.net (VB) error message: "The compiler failed with error code 1"
I'm running a asp.net (VB.NET) on one my servers, and when I try and open it up I'm getting the following error message: Server Error in '/' Application. Compilation Error Description: An error occurred during the compilation of a resource required to service this request. Please review the following specific error details and modify your source code appropriately. Compiler Error Message: The compiler failed with error code 1. Show Detailed Compiler Output: C:\WINNT\system32> "C:\WINNT\Microsoft.NET\Framework\v2.0.50727\vbc.exe" /t:library /utf...

Compiler Error Message: The compiler failed with error code1.
 Hi all, I just installed the software which was fine and no errors... when i went to run it first time at local host it came up with the following error... anyone know what this means?? I have created different ASP.NET projects and it runs no problem... Regards Sicose Server Error in '/PortalVBSDK' Application. Compilation Error Description: An error occurred during the compilation of a resource required to service this request. Please review the following specific error details and modify your source code appropriately. Compiler Error Message: The compiler failed...

Vbc compilation error after migrating ASP.Net 1.1 Web Application to ASP.Net 2.0.
Hi, We migrated our ASP.Net 1.1 web application (it contains code from VB-Webclasses with dataenvironment and DAO) to ASP.Net 2.0. After migration when we are building the solution by clicking Build -> Build Solution from menu we are getting an error in the following way.  Error 1 vbc : Command line (0): error BC2001: file '=' could not be found  Error 2 file '=' could not be found vbc : Command line   Error 3 file 'True' could not be found vbc : Command line  When we tried to browse an ASPX page from our project it is giving following error: Compilation Er...

Compiler Error Message: The compiler failed with error code 128.
 I have deployed my website to a server hosted by a hosting company. (WebHost4life). I keep getting an error message when I try to access the web application via the assigned URL. Does anyone know what the problem is? Why am I getting this error message and how do I fix it? Server Error in '/' Application. Compilation Error Description: An error occurred during the compilation of a resource required to service this request. Please review the following specific error details and modify your source code appropriately. Compiler Error Message: The compiler failed with error code 128...

Compiler Error Message: The compiler failed with error code -1073741502
Hi all, I am posting this just in case this information is useful for other people. I have an ASP.Net page created with VS2005 worked perfectly when running in release mode, but it consistently gave me the following error when running in debug mode within VS2005: Compiler Error Message: The compiler failed with error code -1073741502  The problem was solved after restarting VS.Hong Hi, I appreciate that you share your experience here. Thanks, ThomasThomas SunMicrosoft Online Community SupportPlease remember to click “Mark as Answer” on the post that helps you, and to click...

Compiler Error Message: The compiler failed with error code 128
I recently installed the .net framework 1.1 to one of my IIS servers. I have been running the .net and some of the starter kits on my dev box and it works just great. In addition to trying the time tracking starter kit (which also works great on my dev box), I have tried a very simple test.aspx page. I would appreciate any help or direction on what to do about this. I am new to .net and not even sure what to try to resolve this problem Thanks in advance. -Bob Server Error in '/TTWebVBVS' Application. ----------------------------------------------------------------------...

ASP.net Compilation Error
Hi guys i need some help debugging this compilation error i have a (.aspx) file and the debugger doesn't like these lines. My file was originally an (.asp) adn i m trying to convert that to an (.aspx)   <% If session("Connected") = "N" then %> <p align="left">   <b>   <font color="#FF0000">Authorization Failure - Invalid User ID or PIN.</font></b>  Someone PLZ help What my understanding is that you cannot mix html with coding like you can in asp applications ...

What about a Microsoft .NET PowerBuilder compiler?
No such thing exists. AFAIK, there are no future plans for .NET conversion. -- pbm_hopethishelps, Roy Kiesler [TeamSybase] MySybase - http://my.sybase.com "FLD" <plianez@martinavarro.es> wrote in message news:qyjsU#eKAHA.85@forums.sybase.com... > > > Check out the thread in the general discussion titled "PowerBuilder a .NET language?" "FLD" <plianez@martinavarro.es> wrote in message news:qyjsU#eKAHA.85@forums.sybase.com... > > > Sure, sounds great, when are you planning to release it? "F...

Powerbuilder Error Compiling with a pbd
Hello all, I am getting the following error "Error in destroying a pbni object." when I am trying to compile a target in Powerbuilder 9.0. We have be compiling this target for 6 mo without an error and this just error is now occuring. After the error occurs Powerbuilder bombs. Has any one ran into something like this before and what would be a fix for it Thanks in advance Jim Would help to know what PBNI object you're referencing. What PBDs do you have in your library search path? <Jim Schneider> wrote in message news:4342e0ee.494f.1681692777@sybase.co...

Compilation Error : UI.Web.Global' is defined in multiple places; using definition from 'c:\WINDOWS\Microsoft.NET\Framework\v1.1.4322\Temporary ASP.NET Files\..\NiceMonitoringOperationSolution.DLL
Hi, I have got a problem. When i compile my .net web modules, I get the following error: Compiler Error Message: CS1595: 'NxGen.SnmpSolutions.NiceMonitoring.UI.Web.Global' is defined in multiple places; using definition from 'c:\WINDOWS\Microsoft.NET\Framework\v1.1.4322\Temporary ASP.NET Files\nicemonitoringoperationsolution\a38b2052\fcc07767\assembly\dl2\3eeae226\def59e99_8cefc501\NiceMonitoringOperationSolution.DLL' Source Error:  Line 26:     Line 27:     [System.Runtime.CompilerServices.CompilerGlobalScopeAttribute()]Line 28:  &...

COMPILE ERROR
Hi, I've been struggeling with this problem for some days now :( I truely hope that someone can help out! This is the erorr I get when I try to compile a project for a Pocket PC 2002 (wince 3.0) with eVC++ C:\Tutorial\TestProject2\customer.cpp(10) : error C2146: syntax error : missing ';' before identifier 'Sqlca' C:\Tutorial\TestProject2\customer.cpp(10) : error C2501: 'UlSqlca' : missing storage-class or type specifiers C:\Tutorial\TestProject2\customer.cpp(10) : fatal error C1004: unexpected end of file found This is wha...

asp to asp.net compilation error
Thanks for the previous reply, I am converting an asp application to asp.net, getting the following error Compilation Error Description: An error occurred during the compilation of a resource required to service this request. Please review the following specific error details and modify your source code appropriately. Compiler Error Message: BC32093: 'Of' required when specifying type arguments for a generic type or method.Source Error: Line 281: <td><select name="year" id="year">Line 282: <% Line 283: ...

VS.NET 2005 Compiler Error
When I'm working on VS.NET 2005 with larger projects (several projects loaded, 13 in total) I get the following error: Is there any way to avoid this annoying error, 7-10 times per day!!! PD: the error message says: Microsoft Visual Studio Compiler has detected an error and must be closed. We are sory for the inconvenience. This is a compiler crash. If you can, please zip your solution and send it to me. I can forward it then to VB team. Address mikhaila-at-microsoft-dot-com.Thanks------------------------------------------------------------This posting is provided &q...

Getting compilation error "The compiler failed with error code 128"
Hi All - I am getting a compilation error when I contact AXMS page , below is the error which i got . Compilation Error Description: An error occurred during the compilation of a resource required to service this request. Please review the following specific error details and modify your source code appropriately. Compiler Error Message: The compiler failed with error code 128. when i retstart the system its working fine , but its happening now and then so could not able to predict whats going on .  kindly guide me to eluminate this problem .  Thanks, Jeyaprakash. Tr...

Web resources about - Compiling Error - sybase.powerbuilder.net

Rust 1.1 speeds compiling, adds new APIs
The open source Rust systems language, developed by Mozilla Research with an emphasis on speed and thread safety, has been upgraded with a 1.1 ...

Feds put protest activity under microscope in compiling national 'risk forecast'
Use of social media, the spread of "citizen journalism," and the involvement of young people are among the key trends highlighted by a federal ...

10 Tips For Compiling A Deal Sheet
Compiling a deal sheet is a great way of taking stock of your experience and of seeing where your experience may be lacking.

Compiling 64-Bit Code
Describes the 64-bit features available in OS X.

Is there a benefit to compiling your code as you go?
Compiling allows you to fix errors quickly.

6 cool tools for compiling to JavaScript
Every programmer has a favorite language or two. JavaScript lovers are the luckiest these days because their language is taking over the Internet ...

Andrew Wiggins Is Already Compiling His NBA Highlight Reel
Sure, it's NBA Summer League action but Andrew Wiggins is still out there doing it. The Cavaliers and Sixers summer squads are playing tonight ...

We're Compiling Every Police-Involved Shooting In America. Help Us.
The United States has no database of police shootings. There is no standardized process by which officers log when they've discharged their weapons ...

Flat UI Pro Tutorial: Setting and Compiling Using LESS
In this video tutorial, you use components from Flat UI Pro to create a complete simple mail app using LESS. He takes you through the steps to ...

Industrious 4chan user is compiling a list of every videogame ever made
... me to enter a few hundreds of games into my Backloggery account , and I haven't even finished it yet. Ambitious 4chan user Data_baser is compiling ...

Resources last updated: 1/2/2016 10:31:41 AM