Smoke [blead] v5.15.7-123-g7d76264 FAIL(F) MSWin32 Win2000 SP4 (x86/1 cpu)

Smoke logs available at http://m-l.org/~perl/smoke/perl/

Automated smoke report for 5.15.7 patch 7d76264217df3933754d722dc21cd67d80e=
35df9 v5.15.7-123-g7d76264
perl-win2k: Intel(R) Core(TM) i7 CPU 920 @ 2.67GHz(~2696 MHz) (x86/1 cpu)
    on        MSWin32 - Win2000 SP4
    using     cl version 14.00.50727.762
    smoketime 6 hours 54 minutes (average 1 hour 43 minutes)

Summary: FAIL(F)

O =3D OK  F =3D Failure(s), extended report at the bottom
X =3D Failure(s) under TEST but not under harness
? =3D still running or test results not (yet) available
Build failures during:       - =3D unknown or N/A
c =3D Configure, m =3D make, M =3D make (after miniperl), t =3D make test-p=
rep

v5.15.7-123-g7d76264  Configuration (common) none
----------- ---------------------------------------------------------
O O=20=20=20=20=20=20=20=20=20
F F         -Duseithreads
| +--------- -DDEBUGGING
+----------- no debugging


Locally applied patches:
    uncommitted-changes
    SMOKE7d76264217df3933754d722dc21cd67d80e35df9

Failures: (common-args) none
[default] -Duseithreads
.../t/op/fork.t..............................................FAILED
    16

[default] -DDEBUGGING -Duseithreads
.../t/op/fork.t..............................................FAILED
    16
.../t/op/threads.t...........................................FAILED
    Non-zero exit status: 9
    Bad plan.  You planned 26 tests but ran 9.

Passed Todo tests: (common-args) none
[default]=20
[default] -DDEBUGGING
[default] -Duseithreads
[default] -DDEBUGGING -Duseithreads
.../cpan/CGI/t/tmpdir.t......................................PASSED
    3-9

Compiler messages(MSWin32):
op.c(6482) : warning C4244: 'initializing' : conversion from 'U32' to 'cons=
t char', possible loss of data
op.c(10578) : warning C4028: formal parameter 1 different from declaration
...\pp.c(5948) : warning C4244: 'function' : conversion from 'U32' to 'cons=
t char', possible loss of data
...\pp_hot.c(2679) : warning C4244: 'initializing' : conversion from 'I32' =
to 'U8', possible loss of data
...\pp_sort.c(1668) : warning C4244: 'initializing' : conversion from 'I32'=
 to 'U8', possible loss of data
...\toke.c(754) : warning C4244: '=3D' : conversion from 'U32' to 'unsigned=
 short', possible loss of data
IO.xs(488) : warning C4101: 'ret' : unreferenced local variable
ListUtil.xs(297) : warning C4244: 'initializing' : conversion from 'I32' to=
 'U8', possible loss of data
ListUtil.xs(335) : warning C4244: 'initializing' : conversion from 'I32' to=
 'U8', possible loss of data
Base64.xs(394) : warning C4146: unary minus operator applied to unsigned ty=
pe, result still unsigned
Base64.xs(396) : warning C4146: unary minus operator applied to unsigned ty=
pe, result still unsigned
POSIX.xs(705) : warning C4101: 'charstring' : unreferenced local variable
scalar.xs(175) : warning C4018: '>' : signed/unsigned mismatch
Piece.xs(950) : warning C4101: 'ret' : unreferenced local variable
APItest.xs(2990) : warning C4244: 'initializing' : conversion from 'I32' to=
 'U8', possible loss of data
APItest.xs(3284) : warning C4101: 'tmp' : unreferenced local variable
op.c(10578) : warning C4028: formal parameter 2 different from declaration

--=20
Report by Test::Smoke v1.42 build 1267 running on perl 5.10.0
(Reporter v0.035 / Smoker v0.045)

0
perl
1/30/2012 1:07:00 PM
perl.perl5.porters 48287 articles. 1 followers. Follow

0 Replies
498 Views

Similar Articles

[PageSpeed] 28
Get it on Google Play
Get it on Apple App Store

Reply: