Smoke [5.8.4] 22705 FAIL(Fc) cygwin_nt-5.0 1.5.9(0.112/4/2) (x86/1 cpu)

Automated smoke report for 5.8.4 patch 22705
PC09: x86 Family 15 Model 1 Stepping 2, GenuineIntel (x86/1 cpu)
    on        cygwin_nt-5.0 - 1.5.9(0.112/4/2)
    using     gcc version 3.3.1 (cygming special)
    smoketime 8 hours 2 minutes (average 40 minutes 13 seconds)

Summary: FAIL(Fc)

O =3D OK  F =3D Failure(s), extended report at the bottom
X =3D Failure(s) under TEST but not under harness
? =3D still running or test results not (yet) available
Build failures during:       - =3D unknown or N/A
c =3D Configure, m =3D make, M =3D make (after miniperl), t =3D make test-p=
rep

   22705     Configuration (common) none
----------- ---------------------------------------------------------
F F F F=20=20=20=20=20
F F F F     -Duse64bitint
c - c -     -Duselongdouble
F F F F     -Duseithreads
F F F F     -Duseithreads -Duse64bitint
c - c -     -Duseithreads -Duselongdouble
| | | +----- PERLIO =3D perlio -DDEBUGGING
| | +------- PERLIO =3D stdio  -DDEBUGGING
| +--------- PERLIO =3D perlio
+----------- PERLIO =3D stdio


Failures:
[stdio]=20
[stdio] -DDEBUGGING
[stdio] -Duse64bitint
[stdio] -DDEBUGGING -Duse64bitint
[stdio] -Duseithreads
[stdio] -DDEBUGGING -Duseithreads
[stdio] -Duseithreads -Duse64bitint
[stdio] -DDEBUGGING -Duseithreads -Duse64bitint
    ../ext/IPC/SysV/t/ipcsysv.t.............FAILED 1-16
    ../ext/IPC/SysV/t/msg.t.................FAILED ??
    ../ext/IPC/SysV/t/sem.t.................FAILED ??
    ../lib/ExtUtils/t/Install.t.............FAILED ??
    ../t/io/tell.t..........................FAILED 28
    ../t/op/sysio.t.........................FAILED 39
    ../t/op/taint.t.........................FAILED 150-223

[perlio]=20
[perlio] -DDEBUGGING
[perlio] -Duse64bitint
[perlio] -DDEBUGGING -Duse64bitint
[perlio] -Duseithreads
[perlio] -DDEBUGGING -Duseithreads
[perlio] -Duseithreads -Duse64bitint
[perlio] -DDEBUGGING -Duseithreads -Duse64bitint
    ../ext/IPC/SysV/t/ipcsysv.t.............FAILED 1-16
    ../ext/IPC/SysV/t/msg.t.................FAILED ??
    ../ext/IPC/SysV/t/sem.t.................FAILED ??
    ../lib/ExtUtils/t/Install.t.............FAILED ??
    ../t/op/sysio.t.........................FAILED 39
    ../t/op/taint.t.........................FAILED 150-223

MANIFEST did not declare 'mktest.log'
MANIFEST did not declare 'mktest2.rpt'

--=20
Report by Test::Smoke v1.19-RC1#671 running on perl 5.9.2
(Reporter v0.013 / Smoker v0.014)


0
h
4/16/2004 2:50:00 PM
perl.perl5.porters 48287 articles. 1 followers. Follow

4 Replies
988 Views

Similar Articles

[PageSpeed] 3
Get it on Google Play
Get it on Apple App Store

On Fri, Apr 16, 2004 at 04:50:00PM +0200, "H.Merijn Brand" <h.m.brand@hccnet.nl> wrote:
>     ../t/io/tell.t..........................FAILED 28

This one has been failing for me for a long time (since upgrading from
1.3.22) on maint but not on blead; I just figured out the difference
is usefaststdio; using -Uusefaststdio on 5.8.4 fixes it.
0
sthoenna
6/6/2004 8:14:16 PM
Op een zonnige lentedag (Sunday 06 June 2004 22:14), schreef Yitzchak=20
Scott-Thoennes:

> On Fri, Apr 16, 2004 at 04:50:00PM +0200, "H.Merijn Brand"=20
<h.m.brand@hccnet.nl> wrote:
> >     ../t/io/tell.t..........................FAILED 28
>
> This one has been failing for me for a long time (since upgrading from
> 1.3.22) on maint but not on blead; I just figured out the difference
> is usefaststdio; using -Uusefaststdio on 5.8.4 fixes it.

Merijn, can make that the default in Configure/hints for 5.8.4 then?

btw: Good work Yitzchak!

Abe
--=20
Yitzchak> Or did the "Thanks, applied" autoresponder miss it :)

Autoresponder busy studying Bulgarian EBCDIC locales.  No, I'm
not making this up.  I wish.
                                   -- Jarkko Hietaniemi on p5p @ 2002-01-=
30

0
abe
6/6/2004 9:34:50 PM
On Sun, Jun 06, 2004 at 11:34:50PM +0200, Abe Timmerman <abe@ztreet.demon.nl> wrote:
> Op een zonnige lentedag (Sunday 06 June 2004 22:14), schreef Yitzchak 
> Scott-Thoennes:
> 
> > On Fri, Apr 16, 2004 at 04:50:00PM +0200, "H.Merijn Brand" 
> <h.m.brand@hccnet.nl> wrote:
> > >     ../t/io/tell.t..........................FAILED 28
> >
> > This one has been failing for me for a long time (since upgrading from
> > 1.3.22) on maint but not on blead; I just figured out the difference
> > is usefaststdio; using -Uusefaststdio on 5.8.4 fixes it.
> 
> Merijn, can make that the default in Configure/hints for 5.8.4 then?
> 
> btw: Good work Yitzchak!

usefaststdio of itself isn't the problem, but it has been driving my a
little batty trying to figure out why it failed on maint but not
blead.  If someone with a little knowledge of usefaststdio/perl's
endless layers of io functions and macros could dig into it, maybe the
real problem could get fixed?
0
sthoenna
6/7/2004 7:35:52 AM
Yitzchak Scott-Thoennes <sthoenna@efn.org> writes:
>On Fri, Apr 16, 2004 at 04:50:00PM +0200, "H.Merijn Brand" <h.m.brand@hccn=
et.nl> wrote:
>>     ../t/io/tell.t..........................FAILED 28
>
>This one has been failing for me for a long time (since upgrading from
>1.3.22) on maint but not on blead; I just figured out the difference
>is usefaststdio; using -Uusefaststdio on 5.8.4 fixes it.

And -Dusefaststdio means poke about in FILE * to set count and pointers.
So it seems cygwin 1.3.22 has changed internals of FILE *.

So we need to re-visit its hints or Configure tests to find out=20
why perl thinks it knows how to mess with FILE *.

0
nick
6/7/2004 8:47:59 AM
Reply:

Similar Artilces:

Smoke [5.8.4] 22661 FAIL(Fc) cygwin_nt-5.0 1.5.9(0.112/4/2) (x86/1 cpu)
Automated smoke report for 5.8.4 patch 22661 PC09: Intel(R) Pentium(R) 4 CPU 1.70GHz(~1694 MHz) (x86/1 cpu) on cygwin_nt-5.0 - 1.5.9(0.112/4/2) using gcc version 3.3.1 (cygming special) smoketime 7 hours 34 minutes (average 37 minutes 53 seconds) Summary: FAIL(Fc) O =3D OK F =3D Failure(s), extended report at the bottom X =3D Failure(s) under TEST but not under harness ? =3D still running or test results not (yet) available Build failures during: - =3D unknown or N/A c =3D Configure, m =3D make, M =3D make (after miniperl), t =3D make test-p= rep ...

Smoke [5.8.4] 22871 FAIL(Fc) cygwin_nt-5.0 1.5.10(0.116/4/2) (x86/1 cpu)
Automated smoke report for 5.8.4 patch 22871 PC09: x86 Family 15 Model 1 Stepping 2, GenuineIntel (x86/1 cpu) on cygwin_nt-5.0 - 1.5.10(0.116/4/2) using gcc version 3.3.1 (cygming special) smoketime 9 hours 8 minutes (average 45 minutes 42 seconds) Summary: FAIL(Fc) O =3D OK F =3D Failure(s), extended report at the bottom X =3D Failure(s) under TEST but not under harness ? =3D still running or test results not (yet) available Build failures during: - =3D unknown or N/A c =3D Configure, m =3D make, M =3D make (after miniperl), t =3D make test-p= rep ...

Smoke [5.8.2] 21949 FAIL(Mc) cygwin_nt-5.0 1.5.5(0.94/3/2) (i686/1 cpu)
Automated smoke report for 5.8.2 patch 21949 on cygwin_nt-5.0 - 1.5.5(0.94/= 3/2) (i686/1 cpu) (PC09) using version=20 Report by Test::Smoke v1.18.11 (perl 5.8.2) [1 hour 13 minutes] O =3D OK F =3D Failure(s), extended report at the bottom X =3D test(s) failed under TEST but not under harness ? =3D still running or test results not (yet) available Build failures during: - =3D unknown or N/A c =3D Configure, m =3D make, M =3D make (after miniperl), t =3D make test-p= rep 21949 Configuration (common) none ------------ ------------------------------------------------...

Smoke [5.8.9] maint-5.8-4-g7d6ecb1 FAIL(m) netbsd 5.0.2 (i386/1 cpu) #2
Automated smoke report for 5.8.9 patch 7d6ecb1f6c7eabec011b66526161fcf678919c99 maint-5.8-4-g7d6ecb1 qemu386netbsd5-0-2.bandsman.co.uk: AMD 686-class (i386/1 cpu) on netbsd - 5.0.2 using cc version 4.1.3 20080704 prerelease (NetBSD nb2 20081120) smoketime 1 minute 11 seconds (average 1 minute 11 seconds) Summary: FAIL(m) O = OK F = Failure(s), extended report at the bottom X = Failure(s) under TEST but not under harness ? = still running or test results not (yet) available Build failures during: - = unknown or N/A c = Configure, m = make, M = make (a...

Smoke [5.8.9] maint-5.8-4-g7d6ecb1 FAIL(Xm) netbsd 5.0.1 (i386/1 cpu)
Automated smoke report for 5.8.9 patch 7d6ecb1f6c7eabec011b66526161fcf678919c99 maint-5.8-4-g7d6ecb1 p5netbsd: Intel 686-class (i386/1 cpu) on netbsd - 5.0.1 using cc version 4.1.3 20080704 prerelease (NetBSD nb2 20081120) smoketime 3 hours 37 minutes (average 21 minutes 42 seconds) Summary: FAIL(Xm) O = OK F = Failure(s), extended report at the bottom X = Failure(s) under TEST but not under harness ? = still running or test results not (yet) available Build failures during: - = unknown or N/A c = Configure, m = make, M = make (after miniperl), t = m...

Smoke [5.8.9] maint-5.8-4-g7d6ecb1 FAIL(m) netbsd 5.0.2 (i386/1 cpu)
Automated smoke report for 5.8.9 patch 7d6ecb1f6c7eabec011b66526161fcf678919c99 maint-5.8-4-g7d6ecb1 qemu386netbsd5-0-2.bandsman.co.uk: AMD 686-class (i386/1 cpu) on netbsd - 5.0.2 using cc version 4.1.3 20080704 prerelease (NetBSD nb2 20081120) smoketime 1 minute 4 seconds (average 1 minute 4 seconds) Summary: FAIL(m) O = OK F = Failure(s), extended report at the bottom X = Failure(s) under TEST but not under harness ? = still running or test results not (yet) available Build failures during: - = unknown or N/A c = Configure, m = make, M = make (aft...

SM2.5 crash
I got those traps when trying to 'Edit as new'(?) a previous sent mail and wanted to change the language via right click in subject line. Was reproduce able a few times but now it works. Maybe I tried to fast switching spell checker? ------------------------------------------------------------ 12-06-2011 21:37:47 SYS3171 PID 006e TID 0001 Slot 0077 P:\SEAMONKEY2\SEA!LRQ.EXE c0000005 14dd6ac8 P1=00000002 P2=0002fffc P3=XXXXXXXX P4=XXXXXXXX EAX=00030064 EBX=00030180 ECX=00030180 EDX=27a22940 ESI=24c5ee88 EDI=24c5ee88 DS=0053 DSACC=f0f3 DSLIM=ffffffff ES=0053...

Smoke [5.8.9] maint-5.8-4-g7d6ecb1 FAIL(mc) linux 3.2.0-1-amd64 [debian] (x86_64/2 cpu)
Automated smoke report for 5.8.9 patch 7d6ecb1f6c7eabec011b66526161fcf678919c99 maint-5.8-4-g7d6ecb1 gateway: AMD Athlon(tm) Dual Core Processor 4850e (AuthenticAMD 1800MHz) (x86_64/2 cpu) on linux - 3.2.0-1-amd64 [debian] using cc version 4.6.2 smoketime 16 minutes 16 seconds (average 54.222 seconds) Summary: FAIL(mc) O = OK F = Failure(s), extended report at the bottom X = Failure(s) under TEST but not under harness ? = still running or test results not (yet) available Build failures during: - = unknown or N/A c = Configure, m = make, M = make (aft...

Smoke [5.8.9] maint-5.8-4-g7d6ecb1 FAIL(mc) linux 3.1.0-1-amd64 [debian] (x86_64/8 cpu)
Automated smoke report for 5.8.9 patch 7d6ecb1f6c7eabec011b66526161fcf678919c99 maint-5.8-4-g7d6ecb1 gateway: Intel(R) Core(TM) i7-2600 CPU @ 3.40GHz (GenuineIntel 3392MHz) (x86_64/8 cpu) on linux - 3.1.0-1-amd64 [debian] using cc version 4.6.2 smoketime 5 minutes 40 seconds (average 18.889 seconds) Summary: FAIL(mc) O = OK F = Failure(s), extended report at the bottom X = Failure(s) under TEST but not under harness ? = still running or test results not (yet) available Build failures during: - = unknown or N/A c = Configure, m = make, M = make (after...

Smoke [5.8.9] maint-5.8-4-g7d6ecb1 FAIL(XF) netbsd 4.0 (i386/1 cpu)
Automated smoke report for 5.8.9 patch 7d6ecb1f6c7eabec011b66526161fcf678919c99 maint-5.8-4-g7d6ecb1 philips.bandsman.co.uk: Intel Pentium M (Yonah) (686-class) (i386/1 cpu) on netbsd - 4.0 using cc version 4.1.2 20061021 prerelease (NetBSD nb3 20061125) smoketime 4 hours 10 minutes (average 15 minutes 40 seconds) Summary: FAIL(XF) O = OK F = Failure(s), extended report at the bottom X = Failure(s) under TEST but not under harness ? = still running or test results not (yet) available Build failures during: - = unknown or N/A c = Configure, m = make, ...

Smoke [5.8.9] maint-5.8-4-g7d6ecb1 FAIL(m) netbsd 5.0 (i386/1 cpu)
Automated smoke report for 5.8.9 patch 7d6ecb1f6c7eabec011b66526161fcf678919c99 maint-5.8-4-g7d6ecb1 p5netbsd: Intel 686-class (i386/1 cpu) on netbsd - 5.0 using cc version 4.1.3 20080704 prerelease (NetBSD nb2 20081120) smoketime 1 hour 40 minutes (average 10 minutes 3 seconds) Summary: FAIL(m) O = OK F = Failure(s), extended report at the bottom X = Failure(s) under TEST but not under harness ? = still running or test results not (yet) available Build failures during: - = unknown or N/A c = Configure, m = make, M = make (after miniperl), t = make t...

selecting ? selecting of 1., 2. , 3., 4., 5., 6. is slow (1-3 second) then selecting of 7.,8.,9. go on is so fast (0.1 second or more fast).. how can i get fast for selecting of 1., 2. , 3., 4., 5., 6
hello friends selecting of 1., 2. , 3., 4.(sometime even 5., 6.) is slow (1-3 second) then selecting of 7.,8.,9.(sometimes 5., 6.,) go on is so fast (0.1 second or more fast).. how can i get fast for selecting of 1., 2. , 3., 4., 5., 6. is slow ?? recordcount is almost 1.050.000.. i do selecting 1.2.3. go on same page with treeview1.. treeview1 in masterpage.master.. gridview1 and datasource1 are in pagelist.aspx (it connets datasource1)..productnumber is primarykey for index.. kategori, kategori1 and kategori2, price, datemin are index from keys/index in table1 (right clicking menu)....

Smoke [5.8.2] 21862 FAIL(F) MSWin32 5.1 Service Pack 1 (x86/1 cpu) #4
Automated smoke report for 5.8.2 patch 21862 on MSWin32 - 5.1 Service Pack 1 (x86/1 cpu) (TANGAROA) using cl version 12.00.8804 Report by Test::Smoke v1.18.10 (perl 5.8.2) [3 hours 44 minutes] O = OK F = Failure(s), extended report at the bottom X = test(s) failed under TEST but not under harness ? = still running or test results not (yet) available Build failures during: - = unknown or N/A c = Configure, m = make, M = make (after miniperl), t = make test-prep 21862 Configuration (common) -DINST_TOP=$(INST_DRV)\Smoke\doesntexist ------------ -------------------------...

Smoke [5.9.0] 21706 PASS linux 2.4.18-bf2.4 (i686/1 cpu) (GNU libc 2.2.5)
Automated smoke report for 5.9.0 patch 21706 on linux - 2.4.18-bf2.4 (i686/1 cpu) (alexandra) using cc version 3.0.4 Report by Test::Smoke v1.18 (perl 5.8.2) O = OK F = Failure(s), extended report at the bottom ? = still running or test results not (yet) available Build failures during: - = unknown or N/A c = Configure, m = make, M = make (after miniperl), t = make test-prep 21706 Configuration (common) none ------------ ---------------------------------------------------------------- O - O - -Uuseperlio O O O O O O O O -Duse64bitint O O O O -Duselo...

Web resources about - Smoke [5.8.4] 22705 FAIL(Fc) cygwin_nt-5.0 1.5.9(0.112/4/2) (x86/1 cpu) - perl.perl5.porters

Resources last updated: 12/4/2015 7:18:00 PM