Smoke [5.15.1] v5.15.1-236-ge0a28d1 FAIL(F) linux 3.0.0-1-amd64 [debian] (x86_64/2 cpu)

Automated smoke report for 5.15.1 patch e0a28d18583c9c77dd0a06307df78a2b2d755c5f v5.15.1-236-ge0a28d1
bandsman.dyndns-ip.com: AMD Athlon(tm) Dual Core Processor 4450e (AuthenticAMD 2300MHz) (x86_64/2 cpu)
    on        linux - 3.0.0-1-amd64 [debian]
    using     cc version 4.6.1
    smoketime 51 minutes 20 seconds (average 51 minutes 20 seconds)

Summary: FAIL(F)

O = OK  F = Failure(s), extended report at the bottom
X = Failure(s) under TEST but not under harness
? = still running or test results not (yet) available
Build failures during:       - = unknown or N/A
c = Configure, m = make, M = make (after miniperl), t = make test-prep

v5.15.1-236-ge0a28d1  Configuration (common) -Accflags="-O2 -W -Wformat=2 -Wall -Wextra -pipe -mtune=native -march=native -fomit-frame-pointer -msse2 -msse -mmmx -mfpmath=sse -D_FORTIFY_SOURCE=2 -fstack-protector -Wstack-protector -Wfloat-equal"
----------- ---------------------------------------------------------
F F - -     -Duseithreads
| | | +----- PERLIO = perlio -DDEBUGGING
| | +------- PERLIO = stdio  -DDEBUGGING
| +--------- PERLIO = perlio
+----------- PERLIO = stdio


Locally applied patches:
    uncommitted-changes
    SMOKEe0a28d18583c9c77dd0a06307df78a2b2d755c5f

Failures: (common-args) -Accflags="-O2 -W -Wformat=2 -Wall -Wextra -pipe -mtune=native -march=native -fomit-frame-pointer -msse2 -msse -mmmx -mfpmath=sse -D_FORTIFY_SOURCE=2 -fstack-protector -Wstack-protector -Wfloat-equal"
[stdio] -Duseithreads
    ../lib/perl5db.t............................................FAILED
        8, 11

[perlio] -Duseithreads
    ../lib/perl5db.t............................................FAILED
        8, 11
Inconsistent test results (between TEST and harness):
    ../ext/Socket/t/getaddrinfo.t...........FAILED at test 24

Compiler messages(gcc):
Configure ...try.c: In function ‘main’:
try.c:1:14: warning: unused parameter ‘argc’ [-Wunused-parameter]
try.c:1:26: warning: unused parameter ‘argv’ [-Wunused-parameter]
try.c: In function ‘main’:
try.c: In function ‘blech’:
try.c:8:16: warning: unused parameter ‘s’ [-Wunused-parameter]
try.c: In function ‘blech_in_list’:
try.c:9:24: warning: unused parameter ‘s’ [-Wunused-parameter]
try.c:31:1: warning: control reaches end of non-void function [-Wreturn-type]
try.c:28:16: warning: unused parameter ‘x’ [-Wunused-parameter]
try.c:36:6: warning: ignoring return value of ‘pipe’, declared with attribute warn_unused_result [-Wunused-result]
try.c:37:6: warning: ignoring return value of ‘pipe’, declared with attribute warn_unused_result [-Wunused-result]
try.c:53:8: warning: ignoring return value of ‘write’, declared with attribute warn_unused_result [-Wunused-result]
try.c:66:8: warning: ignoring return value of ‘write’, declared with attribute warn_unused_result [-Wunused-result]
try.c:72:8: warning: ignoring return value of ‘write’, declared with attribute warn_unused_result [-Wunused-result]
try.c:78:6: warning: ignoring return value of ‘read’, declared with attribute warn_unused_result [-Wunused-result]
try.c:8:16: warning: unused parameter ‘x’ [-Wunused-parameter]
try.c:3:15: warning: unused parameter ‘argc’ [-Wunused-parameter]
try.c:3:27: warning: unused parameter ‘argv’ [-Wunused-parameter]
try.c: In function ‘bletch’:
try.c:11:17: warning: unused parameter ‘s’ [-Wunused-parameter]
try.c:12:26: warning: unused parameter ‘argv’ [-Wunused-parameter]
try.c:52:19: warning: comparison between signed and unsigned integer expressions [-Wsign-compare]
try.c:4069:17: warning: extra tokens at end of #ifdef directive [enabled by default]
try.c:4072:18: warning: extra tokens at end of #ifdef directive [enabled by default]
try.c:4075:19: warning: extra tokens at end of #ifdef directive [enabled by default]
try.c:4078:19: warning: extra tokens at end of #ifdef directive [enabled by default]
try.c:4105:17: warning: extra tokens at end of #ifdef directive [enabled by default]
try.c:4108:18: warning: extra tokens at end of #ifdef directive [enabled by default]
try.c:4111:19: warning: extra tokens at end of #ifdef directive [enabled by default]
try.c:4114:19: warning: extra tokens at end of #ifdef directive [enabled by default]
try.c:4165:17: warning: extra tokens at end of #ifdef directive [enabled by default]
try.c:4168:18: warning: extra tokens at end of #ifdef directive [enabled by default]
try.c:4171:19: warning: extra tokens at end of #ifdef directive [enabled by default]
try.c:4174:19: warning: extra tokens at end of #ifdef directive [enabled by default]
try.c:4201:16: warning: extra tokens at end of #ifdef directive [enabled by default]
try.c:4204:17: warning: extra tokens at end of #ifdef directive [enabled by default]
try.c:4207:18: warning: extra tokens at end of #ifdef directive [enabled by default]
try.c:4210:18: warning: extra tokens at end of #ifdef directive [enabled by default]
try.c:4465:18: warning: extra tokens at end of #ifdef directive [enabled by default]
try.c:4468:19: warning: extra tokens at end of #ifdef directive [enabled by default]
try.c:4471:20: warning: extra tokens at end of #ifdef directive [enabled by default]
try.c:4474:20: warning: extra tokens at end of #ifdef directive [enabled by default]
try.c:10249:18: warning: extra tokens at end of #ifdef directive [enabled by default]
try.c:10252:19: warning: extra tokens at end of #ifdef directive [enabled by default]
try.c:10255:20: warning: extra tokens at end of #ifdef directive [enabled by default]
try.c:10258:20: warning: extra tokens at end of #ifdef directive [enabled by default]
try.c:10285:18: warning: extra tokens at end of #ifdef directive [enabled by default]
try.c:10288:19: warning: extra tokens at end of #ifdef directive [enabled by default]
try.c:10291:20: warning: extra tokens at end of #ifdef directive [enabled by default]
try.c:10294:20: warning: extra tokens at end of #ifdef directive [enabled by default]
try.c:10321:18: warning: extra tokens at end of #ifdef directive [enabled by default]
try.c:10324:19: warning: extra tokens at end of #ifdef directive [enabled by default]
try.c:10327:20: warning: extra tokens at end of #ifdef directive [enabled by default]
try.c:10330:20: warning: extra tokens at end of #ifdef directive [enabled by default]
try.c:10357:17: warning: extra tokens at end of #ifdef directive [enabled by default]
try.c:10360:18: warning: extra tokens at end of #ifdef directive [enabled by default]
try.c:10363:19: warning: extra tokens at end of #ifdef directive [enabled by default]
try.c:10366:19: warning: extra tokens at end of #ifdef directive [enabled by default]
try.c:10585:19: warning: extra tokens at end of #ifdef directive [enabled by default]
try.c:10588:20: warning: extra tokens at end of #ifdef directive [enabled by default]
try.c:10591:21: warning: extra tokens at end of #ifdef directive [enabled by default]
try.c:10594:21: warning: extra tokens at end of #ifdef directive [enabled by default]
op.c: In function ‘Perl_scalarvoid’:
op.c:1181:36: warning: comparing floating point with == or != is unsafe [-Wfloat-equal]
op.c:1181:55: warning: comparing floating point with == or != is unsafe [-Wfloat-equal]
perl.c: In function ‘Perl_eval_pv’:
perl.c:2830:27: warning: comparing floating point with == or != is unsafe [-Wfloat-equal]
op.c: In function ‘S_new_logop’:
op.c:5292:26: warning: comparing floating point with == or != is unsafe [-Wfloat-equal]
op.c:5293:26: warning: comparing floating point with == or != is unsafe [-Wfloat-equal]
op.c: In function ‘Perl_newCONDOP’:
op.c:5448:20: warning: comparing floating point with == or != is unsafe [-Wfloat-equal]
op.c: In function ‘Perl_newLOOPOP’:
op.c:5589:44: warning: comparing floating point with == or != is unsafe [-Wfloat-equal]
op.c: In function ‘Perl_newWHILEOP’:
op.c:5733:46: warning: comparing floating point with == or != is unsafe [-Wfloat-equal]
perl.c: In function ‘S_init_tls_and_interp’:
perl.c:105:2: warning: ignoring return value of ‘write’, declared with attribute warn_unused_result [-Wunused-result]
perl.c: In function ‘S_forbid_setid’:
perl.c:3817:1: warning: stack protector not protecting function: all local arrays are less than 8 bytes long [-Wstack-protector]
gv.c: In function ‘Perl_Gv_AMupdate’:
gv.c:1860:14: warning: comparing floating point with == or != is unsafe [-Wfloat-equal]
gv.c: In function ‘Perl_amagic_call’:
gv.c:2255:17: warning: comparing floating point with == or != is unsafe [-Wfloat-equal]
gv.c:2524:7: warning: comparing floating point with == or != is unsafe [-Wfloat-equal]
toke.c: In function ‘S_printbuf’:
toke.c:470:5: warning: format not a string literal, argument types not checked [-Wformat-nonliteral]
toke.c: In function ‘Perl_yylex’:
toke.c:6907:12: warning: format not a string literal, argument types not checked [-Wformat-nonliteral]
toke.c: In function ‘S_pending_ident’:
toke.c:8322:17: warning: format not a string literal, argument types not checked [-Wformat-nonliteral]
toke.c: In function ‘S_new_constant’:
toke.c:8561:24: warning: comparing floating point with == or != is unsafe [-Wfloat-equal]
toke.c: In function ‘S_missingterm’:
toke.c:566:1: warning: stack protector not protecting function: all local arrays are less than 8 bytes long [-Wstack-protector]
regcomp.c: In function ‘S_make_trie’:
regcomp.c:1641:23: warning: comparing floating point with == or != is unsafe [-Wfloat-equal]
dquote_static.c: In function ‘S_grok_bslash_c’:
dquote_static.c:45:1: warning: stack protector not protecting function: all local arrays are less than 8 bytes long [-Wstack-protector]
dump.c: In function ‘Perl_sv_peek’:
dump.c:480:13: warning: comparing floating point with == or != is unsafe [-Wfloat-equal]
dump.c:491:13: warning: comparing floating point with == or != is unsafe [-Wfloat-equal]
util.c: In function ‘Perl_my_strftime’:
util.c:4209:3: warning: format not a string literal, format string not checked [-Wformat-nonliteral]
util.c:4233:7: warning: format not a string literal, format string not checked [-Wformat-nonliteral]
util.c: In function ‘S_write_no_mem’:
util.c:71:5: warning: ignoring return value of ‘write’, declared with attribute warn_unused_result [-Wunused-result]
mg.c: In function ‘Perl_magic_setdbline’:
mg.c:1993:19: warning: comparing floating point with == or != is unsafe [-Wfloat-equal]
mg.c: In function ‘Perl_sighandler’:
mg.c:3118:9: warning: comparing floating point with == or != is unsafe [-Wfloat-equal]
hv.c: In function ‘Perl_hv_common’:
hv.c:495:10: warning: comparing floating point with == or != is unsafe [-Wfloat-equal]
av.c: In function ‘Perl_av_fetch’:
av.c:224:36: warning: comparing floating point with == or != is unsafe [-Wfloat-equal]
av.c: In function ‘Perl_av_store’:
av.c:320:24: warning: comparing floating point with == or != is unsafe [-Wfloat-equal]
av.c: In function ‘Perl_av_delete’:
av.c:840:28: warning: comparing floating point with == or != is unsafe [-Wfloat-equal]
av.c: In function ‘Perl_av_exists’:
av.c:930:28: warning: comparing floating point with == or != is unsafe [-Wfloat-equal]
av.c:953:24: warning: comparing floating point with == or != is unsafe [-Wfloat-equal]
pp_hot.c: In function ‘Perl_pp_and’:
pp_hot.c:103:10: warning: comparing floating point with == or != is unsafe [-Wfloat-equal]
pp_hot.c: In function ‘Perl_pp_cond_expr’:
pp_hot.c:216:9: warning: comparing floating point with == or != is unsafe [-Wfloat-equal]
pp_hot.c: In function ‘Perl_pp_or’:
pp_hot.c:378:9: warning: comparing floating point with == or != is unsafe [-Wfloat-equal]
pp_hot.c: In function ‘Perl_pp_grepwhile’:
pp_hot.c:2409:9: warning: comparing floating point with == or != is unsafe [-Wfloat-equal]
sv.c: In function ‘S_sv_2iuv_non_preserve’:
sv.c:1950:29: warning: comparing floating point with == or != is unsafe [-Wfloat-equal]
sv.c:1959:25: warning: comparing floating point with == or != is unsafe [-Wfloat-equal]
sv.c: In function ‘S_sv_2iuv_common’:
sv.c:2005:20: warning: comparing floating point with == or != is unsafe [-Wfloat-equal]
sv.c:2048:14: warning: comparing floating point with == or != is unsafe [-Wfloat-equal]
sv.c:2194:41: warning: comparing floating point with == or != is unsafe [-Wfloat-equal]
sv.c: In function ‘Perl_sv_2pv_flags’:
sv.c:2745:26: warning: comparing floating point with == or != is unsafe [-Wfloat-equal]
sv.c:2930:16: warning: comparing floating point with == or != is unsafe [-Wfloat-equal]
sv.c: In function ‘Perl_sv_2bool_flags’:
sv.c:3104:10: warning: comparing floating point with == or != is unsafe [-Wfloat-equal]
sv.c:3123:20: warning: comparing floating point with == or != is unsafe [-Wfloat-equal]
sv.c: In function ‘Perl_sv_inc_nomg’:
sv.c:7895:6: warning: comparing floating point with == or != is unsafe [-Wfloat-equal]
sv.c: In function ‘Perl_sv_dec_nomg’:
sv.c:8079:10: warning: comparing floating point with == or != is unsafe [-Wfloat-equal]
sv.c: In function ‘Perl_sv_true’:
sv.c:8936:20: warning: comparing floating point with == or != is unsafe [-Wfloat-equal]
sv.c: In function ‘S_F0convert’:
sv.c:9867:19: warning: comparing floating point with == or != is unsafe [-Wfloat-equal]
sv.c: In function ‘Perl_sv_vcatpvfn’:
sv.c:10715:43: warning: comparing floating point with == or != is unsafe [-Wfloat-equal]
sv.c:10859:4: warning: format not a string literal, argument types not checked [-Wformat-nonliteral]
sv.c:10860:4: warning: format not a string literal, argument types not checked [-Wformat-nonliteral]
sv.c: In function ‘Perl_sv_cat_decode’:
sv.c:13611:8: warning: comparing floating point with == or != is unsafe [-Wfloat-equal]
sv.c: In function ‘Perl_report_uninit’:
sv.c:14201:3: warning: format not a string literal, argument types not checked [-Wformat-nonliteral]
sv.c:14205:7: warning: format not a string literal, argument types not checked [-Wformat-nonliteral]
sv.c: In function ‘Perl_dirp_dup’:
sv.c:11256:11: warning: ignoring return value of ‘fchdir’, declared with attribute warn_unused_result [-Wunused-result]
sv.c:9971:7: warning: ignoring return value of ‘gcvt’, declared with attribute warn_unused_result [-Wunused-result]
sv.c:10809:7: warning: ignoring return value of ‘gcvt’, declared with attribute warn_unused_result [-Wunused-result]
sv.c:2750:3: warning: ignoring return value of ‘gcvt’, declared with attribute warn_unused_result [-Wunused-result]
sv.c:2939:6: warning: ignoring return value of ‘gcvt’, declared with attribute warn_unused_result [-Wunused-result]
pp.c: In function ‘Perl_pp_divide’:
pp.c:1516:12: warning: comparing floating point with == or != is unsafe [-Wfloat-equal]
pp.c: In function ‘Perl_pp_modulo’:
pp.c:1620:10: warning: comparing floating point with == or != is unsafe [-Wfloat-equal]
pp.c:1624:34: warning: comparing floating point with == or != is unsafe [-Wfloat-equal]
pp.c: In function ‘Perl_do_ncmp’:
pp.c:2101:15: warning: comparing floating point with == or != is unsafe [-Wfloat-equal]
pp.c: In function ‘Perl_pp_not’:
pp.c:2343:20: warning: comparing floating point with == or != is unsafe [-Wfloat-equal]
pp.c: In function ‘Perl_pp_rand’:
pp.c:2772:15: warning: comparing floating point with == or != is unsafe [-Wfloat-equal]
sv.c: In function ‘S_varname’:
sv.c:13706:1: warning: stack protector not protecting function: all local arrays are less than 8 bytes long [-Wstack-protector]
pp_ctl.c: In function ‘Perl_pp_formline’:
pp_ctl.c:973:3: warning: format not a string literal, argument types not checked [-Wformat-nonliteral]
pp_ctl.c: In function ‘Perl_pp_range’:
pp_ctl.c:1234:9: warning: comparing floating point with == or != is unsafe [-Wfloat-equal]
pp_ctl.c: In function ‘Perl_pp_flip’:
pp_ctl.c:1263:13: warning: comparing floating point with == or != is unsafe [-Wfloat-equal]
pp_ctl.c: In function ‘Perl_pp_flop’:
pp_ctl.c:1357:13: warning: comparing floating point with == or != is unsafe [-Wfloat-equal]
pp_ctl.c: In function ‘Perl_pp_xor’:
pp_ctl.c:1792:9: warning: comparing floating point with == or != is unsafe [-Wfloat-equal]
pp_ctl.c:1792:25: warning: comparing floating point with == or != is unsafe [-Wfloat-equal]
pp_ctl.c: In function ‘Perl_pp_return’:
pp_ctl.c:2474:44: warning: comparing floating point with == or != is unsafe [-Wfloat-equal]
pp_ctl.c: In function ‘Perl_pp_leaveeval’:
pp_ctl.c:4279:24: warning: comparing floating point with == or != is unsafe [-Wfloat-equal]
pp_ctl.c: In function ‘S_matcher_matches_sv’:
pp_ctl.c:4442:13: warning: comparing floating point with == or != is unsafe [-Wfloat-equal]
pp_ctl.c: In function ‘S_do_smartmatch’:
pp_ctl.c:4552:22: warning: comparing floating point with == or != is unsafe [-Wfloat-equal]
pp_ctl.c:4584:22: warning: comparing floating point with == or != is unsafe [-Wfloat-equal]
pp_ctl.c:4795:9: warning: comparing floating point with == or != is unsafe [-Wfloat-equal]
pp_ctl.c:4856:11: warning: comparing floating point with == or != is unsafe [-Wfloat-equal]
pp_ctl.c:4927:6: warning: comparing floating point with == or != is unsafe [-Wfloat-equal]
pp_ctl.c: In function ‘Perl_pp_enterwhen’:
pp_ctl.c:4952:52: warning: comparing floating point with == or != is unsafe [-Wfloat-equal]
pp_sys.c: In function ‘Perl_pp_stat’:
pp_sys.c:2822:3: warning: format not a string literal, argument types not checked [-Wformat-nonliteral]
pp_sys.c: In function ‘S_try_amagic_ftest’:
pp_sys.c:2925:10: warning: comparing floating point with == or != is unsafe [-Wfloat-equal]
pp_sys.c: In function ‘Perl_pp_ftrread’:
pp_sys.c:2982:5: warning: comparing floating point with == or != is unsafe [-Wfloat-equal]
pp_sys.c: In function ‘Perl_pp_ftis’:
pp_sys.c:3086:5: warning: comparing floating point with == or != is unsafe [-Wfloat-equal]
pp_sys.c: In function ‘Perl_pp_ftrowned’:
pp_sys.c:3143:5: warning: comparing floating point with == or != is unsafe [-Wfloat-equal]
pp_sys.c: In function ‘Perl_pp_fttty’:
pp_sys.c:3261:5: warning: comparing floating point with == or != is unsafe [-Wfloat-equal]
pp_sys.c: In function ‘Perl_pp_fttext’:
pp_sys.c:3314:5: warning: comparing floating point with == or != is unsafe [-Wfloat-equal]
pp_sys.c:3381:3: warning: format not a string literal, argument types not checked [-Wformat-nonliteral]
pp_sys.c: In function ‘Perl_pp_gmtime’:
pp_sys.c:4487:11: warning: comparing floating point with == or != is unsafe [-Wfloat-equal]
doio.c: In function ‘Perl_do_openn’:
doio.c:536:6: warning: format not a string literal, argument types not checked [-Wformat-nonliteral]
doio.c: In function ‘Perl_my_stat_flags’:
doio.c:1326:6: warning: format not a string literal, argument types not checked [-Wformat-nonliteral]
doio.c: In function ‘Perl_my_lstat_flags’:
doio.c:1370:2: warning: format not a string literal, argument types not checked [-Wformat-nonliteral]
doio.c: In function ‘S_exec_failed’:
doio.c:1383:2: warning: ignoring return value of ‘write’, declared with attribute warn_unused_result [-Wunused-result]
doio.c: In function ‘Perl_nextargv’:
doio.c:871:7: warning: ignoring return value of ‘fchown’, declared with attribute warn_unused_result [-Wunused-result]
regexec.c: In function ‘S_regmatch’:
regexec.c:4389:11: warning: comparing floating point with == or != is unsafe [-Wfloat-equal]
utf8.c: In function ‘Perl_swash_init’:
utf8.c:2066:7: warning: comparing floating point with == or != is unsafe [-Wfloat-equal]
utf8.c:2088:10: warning: comparing floating point with == or != is unsafe [-Wfloat-equal]
utf8.c: In function ‘Perl_swash_fetch’:
utf8.c:2121:1: warning: stack protector not protecting function: all local arrays are less than 8 bytes long [-Wstack-protector]
utf8.c: In function ‘Perl__swash_to_invlist’:
utf8.c:2887:1: warning: stack protector not protecting function: all local arrays are less than 8 bytes long [-Wstack-protector]
taint.c: In function ‘Perl_taint_proper’:
taint.c:69:6: warning: format not a string literal, argument types not checked [-Wformat-nonliteral]
universal.c: In function ‘Perl_sv_does’:
universal.c:176:15: warning: comparing floating point with == or != is unsafe [-Wfloat-equal]
universal.c: In function ‘XS_Internals_SvREADONLY’:
universal.c:783:6: warning: comparing floating point with == or != is unsafe [-Wfloat-equal]
universal.c: In function ‘XS_PerlIO_get_layers’:
universal.c:860:16: warning: comparing floating point with == or != is unsafe [-Wfloat-equal]
universal.c:866:17: warning: comparing floating point with == or != is unsafe [-Wfloat-equal]
universal.c:872:18: warning: comparing floating point with == or != is unsafe [-Wfloat-equal]
universal.c: In function ‘XS_re_regname’:
universal.c:1060:23: warning: comparing floating point with == or != is unsafe [-Wfloat-equal]
universal.c: In function ‘XS_re_regnames’:
universal.c:1093:23: warning: comparing floating point with == or != is unsafe [-Wfloat-equal]
perlio.c: In function ‘XS_PerlIO__Layer__find’:
perlio.c:995:34: warning: comparing floating point with == or != is unsafe [-Wfloat-equal]
perlio.c: In function ‘S_more_refcounted_fds’:
perlio.c:2377:2: warning: ignoring return value of ‘write’, declared with attribute warn_unused_result [-Wunused-result]
perlio.c: In function ‘PerlIO_debug’:
perlio.c:510:2: warning: ignoring return value of ‘write’, declared with attribute warn_unused_result [-Wunused-result]
perlio.c: In function ‘PerlIO_getc’:
perlio.c:5234:1: warning: stack protector not protecting function: all local arrays are less than 8 bytes long [-Wstack-protector]
numeric.c: In function ‘S_mulexp10’:
numeric.c:780:15: warning: comparing floating point with == or != is unsafe [-Wfloat-equal]
pp_sort.c: In function ‘S_amagic_ncmp’:
pp_sort.c:1891:13: warning: comparing floating point with == or != is unsafe [-Wfloat-equal]
pp_sort.c: In function ‘S_amagic_i_ncmp’:
pp_sort.c:1912:13: warning: comparing floating point with == or != is unsafe [-Wfloat-equal]
pp_sort.c: In function ‘S_amagic_cmp’:
pp_sort.c:1933:13: warning: comparing floating point with == or != is unsafe [-Wfloat-equal]
pp_sort.c: In function ‘S_amagic_cmp_locale’:
pp_sort.c:1954:13: warning: comparing floating point with == or != is unsafe [-Wfloat-equal]
DynaLoader.c: In function ‘XS_DynaLoader_CLONE’:
DynaLoader.c:433:11: warning: unused variable ‘items’ [-Wunused-variable]
B.xs: In function ‘XS_B_walkoptree_debug’:
B.xs:742:19: warning: comparing floating point with == or != is unsafe [-Wfloat-equal]
B.xs: In function ‘XS_B__GV_FILEGV’:
B.xs:1855:2: warning: null argument where non-null required (argument 2) [-Wnonnull]
compress.c: In function ‘sendMTFValues’:
compress.c:243:19: warning: variable ‘nBytes’ set but not used [-Wunused-but-set-variable]
decompress.c: In function ‘BZ2_decompress’:
decompress.c:106:7: warning: stack protector not protecting function: all local arrays are less than 8 bytes long [-Wstack-protector]
bzlib.c: In function ‘default_bzalloc’:
bzlib.c:107:31: warning: unused parameter ‘opaque’ [-Wunused-parameter]
bzlib.c: In function ‘default_bzfree’:
bzlib.c:114:29: warning: unused parameter ‘opaque’ [-Wunused-parameter]
inflate.c: In function ‘inflate’:
inflate.c:589:13: warning: stack protector not protecting function: all local arrays are less than 8 bytes long [-Wstack-protector]
inflate.c: In function ‘inflateSync’:
inflate.c:1345:13: warning: stack protector not protecting function: all local arrays are less than 8 bytes long [-Wstack-protector]
Zlib.c: In function ‘XS_Compress__Raw__Zlib__inflateStream_inflate’:
Zlib.c:2167:18: warning: comparing floating point with == or != is unsafe [-Wfloat-equal]
Zlib.c:2141:7: warning: variable ‘eof’ set but not used [-Wunused-but-set-variable]
Zlib.c: In function ‘XS_Compress__Raw__Zlib__inflateStream_set_Append’:
Zlib.c:2816:20: warning: comparing floating point with == or != is unsafe [-Wfloat-equal]
Zlib.c: In function ‘XS_Compress__Raw__Zlib__inflateScanStream_scan’:
Zlib.c:3001:18: warning: comparing floating point with == or != is unsafe [-Wfloat-equal]
Zlib.c:2975:7: warning: variable ‘eof’ set but not used [-Wunused-but-set-variable]
Zlib.c:2974:7: warning: variable ‘out’ set but not used [-Wunused-but-set-variable]
Zlib.c: In function ‘XS_Compress__Raw__Zlib_constant’:
../constants.xs:38:11: warning: ‘iv’ may be used uninitialized in this function [-Wuninitialized]
Dumper.xs: In function ‘DD_dump’:
Dumper.xs:321:10: warning: comparing floating point with == or != is unsafe [-Wfloat-equal]
Dumper.xs:817:6: warning: format ‘%ld’ expects argument of type ‘long int’, but argument 2 has type ‘U32’ [-Wformat]
Dumper.xs: In function ‘XS_Data__Dumper_Dumpxs’:
Dumper.xs:1091:15: warning: comparing floating point with == or != is unsafe [-Wfloat-equal]
Dumper.xs:1113:18: warning: comparing floating point with == or != is unsafe [-Wfloat-equal]
Dumper.xs:1115:19: warning: comparing floating point with == or != is unsafe [-Wfloat-equal]
Dumper.xs:1122:13: warning: comparing floating point with == or != is unsafe [-Wfloat-equal]
DB_File.xs: In function ‘db_put’:
DB_File.xs:518:9: warning: comparison between signed and unsigned integer expressions [-Wsign-compare]
DB_File.xs: In function ‘btree_compare’:
DB_File.xs:542:20: warning: unused parameter ‘db’ [-Wunused-parameter]
DB_File.xs: In function ‘btree_prefix’:
DB_File.xs:628:19: warning: unused parameter ‘db’ [-Wunused-parameter]
DB_File.xs: In function ‘hash_cb’:
DB_File.xs:718:14: warning: unused parameter ‘db’ [-Wunused-parameter]
DB_File.xs: In function ‘db_errcall_cb’:
DB_File.xs:792:29: warning: unused parameter ‘dbenv’ [-Wunused-parameter]
DB_File.c: In function ‘XS_DB_File_DELETE’:
DB_File.c:1797:8: warning: variable ‘flags’ set but not used [-Wunused-but-set-variable]
DB_File.c: In function ‘XS_DB_File_STORE’:
DB_File.c:2002:8: warning: variable ‘flags’ set but not used [-Wunused-but-set-variable]
DB_File.xs: In function ‘boot_DB_File’:
DB_File.xs:1497:10: warning: unused variable ‘sv_err’ [-Wunused-variable]
DB_File.c: In function ‘XS_DB_File_constant’:
Peek.xs: In function ‘XS_Devel__Peek_Dump’:
Peek.xs:353:5: warning: comparing floating point with == or != is unsafe [-Wfloat-equal]
Peek.xs: In function ‘XS_Devel__Peek_DumpArray’:
Peek.xs:372:2: warning: comparing floating point with == or != is unsafe [-Wfloat-equal]
RealPPPort.xs: In function ‘XS_Devel__PPPort_other_variables’:
RealPPPort.xs:405:3: warning: the comparison will always evaluate as ‘true’ for the address of ‘PL_no_modify’ will never be NULL [-Waddress]
RealPPPort.xs: In function ‘XS_Devel__PPPort_ptrtests’:
RealPPPort.xs:1094:23: warning: comparing floating point with == or != is unsafe [-Wfloat-equal]
RealPPPort.xs: In function ‘XS_Devel__PPPort_ERRSV’:
RealPPPort.xs:1190:12: warning: comparing floating point with == or != is unsafe [-Wfloat-equal]
MD5.xs: In function ‘XS_Digest__MD5_md5’:
MD5.xs:708:27: warning: null argument where non-null required (argument 1) [-Wnonnull]
MD5.xs:721:27: warning: null argument where non-null required (argument 1) [-Wnonnull]
src/sha.c: In function ‘shabase64’:
src/sha.c:459:27: warning: comparison between signed and unsigned integer expressions [-Wsign-compare]
src/sha.c: In function ‘encbase64’:
src/sha.c:435:13: warning: stack protector not protecting function: all local arrays are less than 8 bytes long [-Wstack-protector]
src/sha.c:451:7: warning: stack protector not protecting function: all local arrays are less than 8 bytes long [-Wstack-protector]
Encode.xs: In function ‘_encoded_utf8_to_bytes’:
Encode.xs:29:1: warning: unused parameter ‘sv’ [-Wunused-parameter]
Encode.xs:29:1: warning: unused parameter ‘encoding’ [-Wunused-parameter]
Encode.xs: In function ‘_encoded_bytes_to_utf8’:
Encode.xs:30:1: warning: unused parameter ‘sv’ [-Wunused-parameter]
Encode.xs:30:1: warning: unused parameter ‘encoding’ [-Wunused-parameter]
Encode.xs: In function ‘call_failure’:
Encode.xs:62:19: warning: unused parameter ‘routine’ [-Wunused-parameter]
Encode.xs:62:33: warning: unused parameter ‘done’ [-Wunused-parameter]
Encode.xs:62:44: warning: unused parameter ‘dest’ [-Wunused-parameter]
Encode.xs:62:55: warning: unused parameter ‘orig’ [-Wunused-parameter]
Encode.xs: In function ‘strict_utf8’:
Encode.xs:305:12: warning: comparing floating point with == or != is unsafe [-Wfloat-equal]
Encode.xs: In function ‘process_utf8’:
Encode.xs:356:22: warning: comparison between signed and unsigned integer expressions [-Wsign-compare]
Encode.xs:360:30: warning: comparison between signed and unsigned integer expressions [-Wsign-compare]
Encode.c: In function ‘XS_Encode__utf8_encode_xs’:
Encode.xs:499:10: warning: unused variable ‘renewed’ [-Wunused-variable]
Encode.c: In function ‘XS_Encode__XS_renew’:
Encode.c:668:7: warning: unused variable ‘obj’ [-Wunused-variable]
Encode.c: In function ‘XS_Encode__XS_renewed’:
Encode.c:691:7: warning: unused variable ‘obj’ [-Wunused-variable]
Encode.c: In function ‘XS_Encode__XS_needs_lines’:
Encode.c:894:7: warning: unused variable ‘obj’ [-Wunused-variable]
Encode.xs: In function ‘XS_Encode__XS_perlio_ok’:
Encode.xs:682:9: warning: comparing floating point with == or != is unsafe [-Wfloat-equal]
Encode.c:919:7: warning: unused variable ‘obj’ [-Wunused-variable]
Encode.xs: In function ‘XS_Encode__XS_mime_name’:
Encode.xs:699:9: warning: comparing floating point with == or != is unsafe [-Wfloat-equal]
Encode.xs: In function ‘XS_Encode__utf8_to_bytes’:
Encode.xs:762:9: warning: comparing floating point with == or != is unsafe [-Wfloat-equal]
bsd_glob.c: In function ‘glob3’:
bsd_glob.c:723:28: warning: unused parameter ‘pattern_last’ [-Wunused-parameter]
bsd_glob.c: In function ‘globextend’:
bsd_glob.c:883:24: warning: comparison between signed and unsigned integer expressions [-Wsign-compare]
Glob.xs: In function ‘boot_File__Glob’:
Glob.xs:90:5: warning: unused variable ‘my_cxtp’ [-Wunused-variable]
Call.xs: In function ‘filter_call’:
Call.xs:63:3: warning: format ‘%d’ expects argument of type ‘int’, but argument 3 has type ‘STRLEN’ [-Wformat]
Call.xs:63:3: warning: format ‘%d’ expects argument of type ‘int’, but argument 5 has type ‘STRLEN’ [-Wformat]
Call.xs:100:5: warning: format ‘%d’ expects argument of type ‘int’, but argument 4 has type ‘STRLEN’ [-Wformat]
Call.xs:156:8: warning: format ‘%d’ expects argument of type ‘int’, but argument 3 has type ‘STRLEN’ [-Wformat]
Call.xs:175:48: warning: signed and unsigned type in conditional expression [-Wsign-compare]
Call.xs:175:14: warning: format ‘%d’ expects argument of type ‘int’, but argument 4 has type ‘STRLEN’ [-Wformat]
Call.xs:186:47: warning: signed and unsigned type in conditional expression [-Wsign-compare]
Call.c: In function ‘XS_Filter__Util__Call_unimport’:
Call.c:368:15: warning: variable ‘package’ set but not used [-Wunused-but-set-variable]
SysV.c: In function ‘XS_IPC__SysV__constant’:
../const-xs.inc:38:11: warning: ‘iv’ may be used uninitialized in this function [-Wuninitialized]
ListUtil.xs: In function ‘XS_List__Util_min’:
ListUtil.xs:159:18: warning: comparing floating point with == or != is unsafe [-Wfloat-equal]
ListUtil.xs: In function ‘XS_List__Util_reduce’:
ListUtil.xs:281:5: warning: variable ‘newsp’ set but not used [-Wunused-but-set-variable]
ListUtil.xs: In function ‘XS_List__Util_first’:
ListUtil.xs:341:6: warning: comparing floating point with == or != is unsafe [-Wfloat-equal]
ListUtil.xs:320:5: warning: variable ‘newsp’ set but not used [-Wunused-but-set-variable]
ListUtil.c: In function ‘XS_List__Util_min’:
ListUtil.xs:173:20: warning: ‘retval’ may be used uninitialized in this function [-Wuninitialized]
Base64.xs: In function ‘XS_MIME__QuotedPrint_encode_qp’:
Base64.xs:347:25: warning: comparing floating point with == or != is unsafe [-Wfloat-equal]
Base64.c: In function ‘XS_MIME__QuotedPrint_decode_qp’:
Base64.c:570:1: warning: stack protector not protecting function: all local arrays are less than 8 bytes long [-Wstack-protector]
Base64.c: In function ‘XS_MIME__Base64_decode_base64’:
Base64.c:259:1: warning: stack protector not protecting function: all local arrays are less than 8 bytes long [-Wstack-protector]
Opcode.xs: In function ‘XS_Opcode__safe_pkg_prep’:
Opcode.xs:264:9: warning: null argument where non-null required (argument 1) [-Wnonnull]
encoding.xs: In function ‘PerlIOEncode_pushed’:
encoding.xs:121:51: warning: comparing floating point with == or != is unsafe [-Wfloat-equal]
encoding.xs:135:57: warning: comparing floating point with == or != is unsafe [-Wfloat-equal]
encoding.xs:144:10: warning: comparing floating point with == or != is unsafe [-Wfloat-equal]
via.xs: In function ‘PerlIOVia_method’:
via.xs:90:12: warning: null argument where non-null required (argument 2) [-Wnonnull]
via.xs: In function ‘PerlIOVia_pushed’:
via.xs:175:17: warning: comparing floating point with == or != is unsafe [-Wfloat-equal]
via.xs: In function ‘PerlIOVia_open’:
via.xs:247:16: warning: comparing floating point with == or != is unsafe [-Wfloat-equal]
POSIX.c: In function ‘XS_POSIX__SigSet_new’:
POSIX.c:744:15: warning: variable ‘packname’ set but not used [-Wunused-but-set-variable]
POSIX.c: In function ‘XS_POSIX__Termios_new’:
POSIX.c:995:15: warning: variable ‘packname’ set but not used [-Wunused-but-set-variable]
POSIX.xs: In function ‘XS_POSIX_sigaction’:
POSIX.xs:1414:9: warning: comparing floating point with == or != is unsafe [-Wfloat-equal]
POSIX.xs:1446:6: warning: comparing floating point with == or != is unsafe [-Wfloat-equal]
POSIX.xs:1486:4: warning: comparing floating point with == or != is unsafe [-Wfloat-equal]
POSIX.xs:541:1: warning: ‘not_here’ defined but not used [-Wunused-function]
re_exec.c: In function ‘S_regmatch’:
re_exec.c:4389:11: warning: comparing floating point with == or != is unsafe [-Wfloat-equal]
Unicode.xs: In function ‘XS_Encode__Unicode_decode_xs’:
Unicode.xs:175:6: warning: comparing floating point with == or != is unsafe [-Wfloat-equal]
Unicode.xs:176:6: warning: value computed is not used [-Wunused-value]
Unicode.xs:194:10: warning: comparing floating point with == or != is unsafe [-Wfloat-equal]
Unicode.xs: In function ‘XS_Encode__Unicode_encode_xs’:
Unicode.xs:333:6: warning: comparing floating point with == or != is unsafe [-Wfloat-equal]
Unicode.xs:334:6: warning: value computed is not used [-Wunused-value]
Unicode.xs:349:14: warning: comparing floating point with == or != is unsafe [-Wfloat-equal]
re_comp.c: In function ‘S_make_trie’:
re_comp.c:1641:23: warning: comparing floating point with == or != is unsafe [-Wfloat-equal]
re_comp.c:6029:1: warning: ‘S_invlist_extend’ defined but not used [-Wunused-function]
sdbm.c: In function ‘makroom’:
sdbm.c:371:2: warning: ignoring return value of ‘write’, declared with attribute warn_unused_result [-Wunused-result]
SDBM_File.c: In function ‘XS_SDBM_File_NEXTKEY’:
SDBM_File.c:411:12: warning: variable ‘key’ set but not used [-Wunused-but-set-variable]
Socket.c: In function ‘XS_Socket_inet_ntop’:
Socket.xs:734:18: warning: variable ‘struct_size’ set but not used [-Wunused-but-set-variable]
Storable.xs: In function ‘store_hash’:
Storable.xs:2353:5: warning: comparing floating point with == or != is unsafe [-Wfloat-equal]
Storable.xs: In function ‘store_code’:
Storable.xs:2641:4: warning: comparing floating point with == or != is unsafe [-Wfloat-equal]
Storable.xs: In function ‘store_other’:
Storable.xs:3422:4: warning: comparing floating point with == or != is unsafe [-Wfloat-equal]
Storable.xs: In function ‘retrieve_hook’:
Storable.xs:4104:2: warning: null argument where non-null required (argument 2) [-Wnonnull]
Storable.xs: In function ‘retrieve_code’:
Storable.xs:5424:7: warning: comparing floating point with == or != is unsafe [-Wfloat-equal]
Storable.xs:5428:5: warning: comparing floating point with == or != is unsafe [-Wfloat-equal]
Storable.xs:5458:6: warning: comparing floating point with == or != is unsafe [-Wfloat-equal]
Storable.xs: In function ‘old_retrieve_array’:
Storable.xs:5509:2: warning: null argument where non-null required (argument 2) [-Wnonnull]
Storable.xs: In function ‘old_retrieve_hash’:
Storable.xs:5572:2: warning: null argument where non-null required (argument 2) [-Wnonnull]
Storable.xs: In function ‘magic_check’:
Storable.xs:5758:24: warning: comparing floating point with == or != is unsafe [-Wfloat-equal]
Storable.xs: In function ‘retrieve’:
Storable.xs:5929:24: warning: comparing floating point with == or != is unsafe [-Wfloat-equal]
Storable.xs:1651:12: warning: ‘is_storing’ defined but not used [-Wunused-function]
Storable.xs:1663:12: warning: ‘is_retrieving’ defined but not used [-Wunused-function]
threads.xs:391:1: warning: missing initializer [-Wmissing-field-initializers]
threads.xs:391:1: warning: (near initialization for ‘ithread_vtbl.svt_local’) [-Wmissing-field-initializers]
threads.xs: In function ‘S_ithread_run’:
threads.xs:546:13: warning: comparing floating point with == or != is unsafe [-Wfloat-equal]
threads.xs: In function ‘XS_threads_create’:
threads.xs:1014:25: warning: comparing floating point with == or != is unsafe [-Wfloat-equal]
threads.xs:1054:21: warning: comparing floating point with == or != is unsafe [-Wfloat-equal]
threads.xs:1058:21: warning: comparing floating point with == or != is unsafe [-Wfloat-equal]
threads.xs:1062:21: warning: comparing floating point with == or != is unsafe [-Wfloat-equal]
threads.xs:1066:21: warning: comparing floating point with == or != is unsafe [-Wfloat-equal]
threads.xs: In function ‘XS_threads_list’:
threads.xs:1126:28: warning: comparing floating point with == or != is unsafe [-Wfloat-equal]
threads.xs: In function ‘XS_threads_set_thread_exit_only’:
threads.xs:1658:13: warning: comparing floating point with == or != is unsafe [-Wfloat-equal]
threads.xs: In function ‘boot_threads’:
threads.xs:1753:5: warning: unused variable ‘my_cxtp’ [-Wunused-variable]
threads.c: In function ‘S_ithread_create’:
threads.xs:711:9: warning: ignoring return value of ‘write’, declared with attribute warn_unused_result [-Wunused-result]
threads.xs:468:9: warning: variable ‘exit_app’ might be clobbered by ‘longjmp’ or ‘vfork’ [-Wclobbered]
threads.xs:469:9: warning: variable ‘exit_code’ might be clobbered by ‘longjmp’ or ‘vfork’ [-Wclobbered]
threads.xs:496:13: warning: variable ‘len’ might be clobbered by ‘longjmp’ or ‘vfork’ [-Wclobbered]
NamedCapture.xs: In function ‘XS_Tie__Hash__NamedCapture_TIEHASH’:
NamedCapture.xs:56:10: warning: comparing floating point with == or != is unsafe [-Wfloat-equal]
Piece.xs: In function ‘_strptime’:
Piece.xs:682:18: warning: comparison between signed and unsigned integer expressions [-Wsign-compare]
Piece.xs:776:18: warning: comparison between signed and unsigned integer expressions [-Wsign-compare]
Piece.xs: In function ‘our_strptime’:
Piece.xs:950:8: warning: unused variable ‘ret’ [-Wunused-variable]
Piece.xs: In function ‘XS_Time__Piece__strftime’:
Piece.xs:989:9: warning: format not a string literal, format string not checked [-Wformat-nonliteral]
Piece.xs:1004:29: warning: comparison between signed and unsigned integer expressions [-Wsign-compare]
Piece.xs:1015:13: warning: format not a string literal, format string not checked [-Wformat-nonliteral]
Piece.xs:345:13: warning: ‘copyright’ defined but not used [-Wunused-variable]
Piece.xs:347:13: warning: ‘sccsid’ defined but not used [-Wunused-variable]
HiRes.c: In function ‘XS_Time__HiRes_constant’:
Collate.xs: In function ‘XS_Unicode__Collate_mk_SortKey’:
Collate.xs:443:22: warning: comparing floating point with == or != is unsafe [-Wfloat-equal]
Collate.xs:445:20: warning: comparing floating point with == or != is unsafe [-Wfloat-equal]
Collate.xs: In function ‘XS_Unicode__Collate_varCE’:
Collate.xs:570:19: warning: comparing floating point with == or != is unsafe [-Wfloat-equal]
Collate.xs:595:2: warning: statement with no effect [-Wunused-value]
Collate.xs:605:2: warning: statement with no effect [-Wunused-value]
Normalize.xs: In function ‘XS_Unicode__Normalize_decompose’:
Normalize.xs:458:55: warning: comparing floating point with == or != is unsafe [-Wfloat-equal]
Normalize.c: In function ‘XS_Unicode__Normalize_isComp2nd’:
Normalize.c:1048:5: warning: unused variable ‘ix’ [-Wunused-variable]
Typemap.c: In function ‘XS_XS__Typemap_T_BOOL’:
Typemap.c:434:18: warning: comparing floating point with == or != is unsafe [-Wfloat-equal]
APItest.xs:262:1: warning: missing initializer [-Wmissing-field-initializers]
APItest.xs:262:1: warning: (near initialization for ‘rmagical_b.svt_set’) [-Wmissing-field-initializers]
APItest.xs: In function ‘THX_keyword_active’:
APItest.xs:951:18: warning: comparing floating point with == or != is unsafe [-Wfloat-equal]
APItest.xs: In function ‘filter_call’:
APItest.xs:1050:11: warning: unused variable ‘my_sv’ [-Wunused-variable]
APItest.c: In function ‘XS_XS__APItest_my_cxt_getsv’:
APItest.c:3299:19: warning: comparing floating point with == or != is unsafe [-Wfloat-equal]
APItest.xs: In function ‘XS_XS__APItest_rmagical_cast’:
APItest.xs:1946:6: warning: comparing floating point with == or != is unsafe [-Wfloat-equal]
APItest.c: In function ‘XS_XS__APItest_bhk_record’:
APItest.c:3747:18: warning: comparing floating point with == or != is unsafe [-Wfloat-equal]
APItest.c: In function ‘XS_XS__APItest_test_rv2cv_op_cv’:
APItest.xs:2184:16: warning: variable ‘wibble_gv’ set but not used [-Wunused-but-set-variable]
APItest.xs: In function ‘XS_XS__APItest_multicall_each’:
APItest.xs:2729:5: warning: variable ‘newsp’ set but not used [-Wunused-but-set-variable]
FastCalc.xs: In function ‘XS_Math__BigInt__FastCalc___strip_zeros’:
FastCalc.xs:167:22: warning: comparing floating point with == or != is unsafe [-Wfloat-equal]
FastCalc.xs: In function ‘XS_Math__BigInt__FastCalc__acmp’:
FastCalc.xs:395:19: warning: comparing floating point with == or != is unsafe [-Wfloat-equal]
a2py.c: In function ‘main’:
a2py.c:62:75: warning: unused parameter ‘env’ [-Wunused-parameter]
ExtTest.c: In function ‘XS_ExtTest_constant’:
ExtTest.xs:465:11: warning: ‘pv’ may be used uninitialized in this function [-Wuninitialized]
ExtTest.xs:418:6: warning: ‘iv’ may be used uninitialized in this function [-Wuninitialized]
ExtTest.xs:236:11: warning: ‘iv’ may be used uninitialized in this function [-Wuninitialized]
ExtTest.xs:217:11: warning: ‘iv’ may be used uninitialized in this function [-Wuninitialized]
XSMore.c: In function ‘XS_XSMore_nil’:
XSMore.c:448:4: warning: unused variable ‘items’ [-Wunused-variable]
XSUsage.c: In function ‘XS_XSUsage_two’:
XSUsage.c:118:5: warning: unused variable ‘ix’ [-Wunused-variable]
XSUsage.c: In function ‘XS_XSUsage_four’:
XSUsage.c:159:11: warning: unused variable ‘items’ [-Wunused-variable]

-- 
Report by Test::Smoke v1.44 build 1285 running on perl 5.12.4
(Reporter v0.035 / Smoker v0.045)
0
njh
8/10/2011 1:17:34 AM
perl.perl5.porters 48287 articles. 1 followers. Follow

0 Replies
627 Views

Similar Articles

[PageSpeed] 31
Get it on Google Play
Get it on Apple App Store

Reply:

Similar Artilces:

Smoke [5.15.1] v5.15.1-298-gc192154 FAIL(F) linux 3.0.0-1-amd64 [debian] (x86_64/2 cpu)
Automated smoke report for 5.15.1 patch c192154b7b5060196110d20f17b18135fa216641 v5.15.1-298-gc192154 bandsman.dyndns-ip.com: AMD Athlon(tm) Dual Core Processor 4450e (AuthenticAMD 2300MHz) (x86_64/2 cpu) on linux - 3.0.0-1-amd64 [debian] using cc version 4.6.1 smoketime 45 minutes 38 seconds (average 45 minutes 38 seconds) Summary: FAIL(F) O = OK F = Failure(s), extended report at the bottom X = Failure(s) under TEST but not under harness ? = still running or test results not (yet) available Build failures during: - = unknown or N/A c = Configure, m...

Smoke [5.15.1] v5.15.1-285-g614391c FAIL(F) linux 3.0.0-1-amd64 [debian] (x86_64/2 cpu)
Automated smoke report for 5.15.1 patch 614391c851ec80dcd07508e7bc23777b88990e47 v5.15.1-285-g614391c bandsman.dyndns-ip.com: AMD Athlon(tm) Dual Core Processor 4450e (AuthenticAMD 2300MHz) (x86_64/2 cpu) on linux - 3.0.0-1-amd64 [debian] using cc version 4.6.1 smoketime 1 hour (average 1 hour) Summary: FAIL(F) O = OK F = Failure(s), extended report at the bottom X = Failure(s) under TEST but not under harness ? = still running or test results not (yet) available Build failures during: - = unknown or N/A c = Configure, m = make, M = make (after minip...

Smoke [5.15.1] v5.15.1-312-gbad4ae3 FAIL(F) linux 3.0.0-1-amd64 [debian] (x86_64/2 cpu)
Automated smoke report for 5.15.1 patch bad4ae388d7276039782b23915670f267acaff1d v5.15.1-312-gbad4ae3 bandsman.dyndns-ip.com: AMD Athlon(tm) Dual Core Processor 4450e (AuthenticAMD 2300MHz) (x86_64/2 cpu) on linux - 3.0.0-1-amd64 [debian] using cc version 4.6.1 smoketime 48 minutes 57 seconds (average 48 minutes 57 seconds) Summary: FAIL(F) O = OK F = Failure(s), extended report at the bottom X = Failure(s) under TEST but not under harness ? = still running or test results not (yet) available Build failures during: - = unknown or N/A c = Configure, m...

Smoke [5.15.1] v5.15.1-268-gd9f179d FAIL(F) linux 3.0.0-1-amd64 [debian] (x86_64/2 cpu)
Automated smoke report for 5.15.1 patch d9f179d8be3032dd79198d1b604a6e3e677455be v5.15.1-268-gd9f179d bandsman.dyndns-ip.com: AMD Athlon(tm) Dual Core Processor 4450e (AuthenticAMD 2300MHz) (x86_64/2 cpu) on linux - 3.0.0-1-amd64 [debian] using cc version 4.6.1 smoketime 46 minutes 24 seconds (average 46 minutes 24 seconds) Summary: FAIL(F) O = OK F = Failure(s), extended report at the bottom X = Failure(s) under TEST but not under harness ? = still running or test results not (yet) available Build failures during: - = unknown or N/A c = Configure, m...

Smoke [5.15.1] v5.15.1-264-g135c0b0 FAIL(F) linux 3.0.0-1-amd64 [debian] (x86_64/2 cpu)
Automated smoke report for 5.15.1 patch 135c0b08fa622fdfc35bb98fe891d70f59a7a3af v5.15.1-264-g135c0b0 bandsman.dyndns-ip.com: AMD Athlon(tm) Dual Core Processor 4450e (AuthenticAMD 2300MHz) (x86_64/2 cpu) on linux - 3.0.0-1-amd64 [debian] using cc version 4.6.1 smoketime 52 minutes 28 seconds (average 52 minutes 28 seconds) Summary: FAIL(F) O = OK F = Failure(s), extended report at the bottom X = Failure(s) under TEST but not under harness ? = still running or test results not (yet) available Build failures during: - = unknown or N/A c = Configure, m...

Smoke [5.15.1] v5.15.1-310-g78656f2 FAIL(F) linux 3.0.0-1-amd64 [debian] (x86_64/2 cpu)
Automated smoke report for 5.15.1 patch 78656f2d7ea5564cffd64f61e656bbaa156aa065 v5.15.1-310-g78656f2 bandsman.dyndns-ip.com: AMD Athlon(tm) Dual Core Processor 4450e (AuthenticAMD 2300MHz) (x86_64/2 cpu) on linux - 3.0.0-1-amd64 [debian] using cc version 4.6.1 smoketime 2 hours 13 minutes (average 2 hours 13 minutes) Summary: FAIL(F) O = OK F = Failure(s), extended report at the bottom X = Failure(s) under TEST but not under harness ? = still running or test results not (yet) available Build failures during: - = unknown or N/A c = Configure, m = mak...

Smoke [5.15.1] v5.15.1-255-geb796c7 FAIL(F) linux 3.0.0-1-amd64 [debian] (x86_64/2 cpu)
Automated smoke report for 5.15.1 patch eb796c7f1a47acbd996034731639c1bb76e31a19 v5.15.1-255-geb796c7 bandsman.dyndns-ip.com: AMD Athlon(tm) Dual Core Processor 4450e (AuthenticAMD 2300MHz) (x86_64/2 cpu) on linux - 3.0.0-1-amd64 [debian] using cc version 4.6.1 smoketime 52 minutes 51 seconds (average 52 minutes 51 seconds) Summary: FAIL(F) O = OK F = Failure(s), extended report at the bottom X = Failure(s) under TEST but not under harness ? = still running or test results not (yet) available Build failures during: - = unknown or N/A c = Configure, m...

Smoke [5.15.1] v5.15.1-329-ga264864 FAIL(F) linux 3.0.0-1-amd64 [debian] (x86_64/2 cpu)
Automated smoke report for 5.15.1 patch a264864ddee69cca13647105cf328e3f5b3fbf01 v5.15.1-329-ga264864 bandsman.dyndns-ip.com: AMD Athlon(tm) Dual Core Processor 4450e (AuthenticAMD 2300MHz) (x86_64/2 cpu) on linux - 3.0.0-1-amd64 [debian] using cc version 4.6.1 smoketime 1 hour 6 minutes (average 1 hour 6 minutes) Summary: FAIL(F) O = OK F = Failure(s), extended report at the bottom X = Failure(s) under TEST but not under harness ? = still running or test results not (yet) available Build failures during: - = unknown or N/A c = Configure, m = make, M...

Smoke [5.15.1] v5.15.1-74-gc3ea6d2 FAIL(F) linux 3.0.0-1-amd64 [debian] (x86_64/2 cpu)
Automated smoke report for 5.15.1 patch c3ea6d286d7ce2cab156ba526ee6161272c45eb3 v5.15.1-74-gc3ea6d2 bandsman.dyndns-ip.com: AMD Athlon(tm) Dual Core Processor 4450e (AuthenticAMD 2300MHz) (x86_64/2 cpu) on linux - 3.0.0-1-amd64 [debian] using cc version 4.6.1 smoketime 45 minutes 4 seconds (average 45 minutes 4 seconds) Summary: FAIL(F) O = OK F = Failure(s), extended report at the bottom X = Failure(s) under TEST but not under harness ? = still running or test results not (yet) available Build failures during: - = unknown or N/A c = Configure, m = ...

Smoke [5.15.1] v5.15.1-78-g9feb131 FAIL(F) linux 3.0.0-1-amd64 [debian] (x86_64/2 cpu)
Automated smoke report for 5.15.1 patch 9feb131675d04c74cc7462275ae5b70055f1c4ba v5.15.1-78-g9feb131 bandsman.dyndns-ip.com: AMD Athlon(tm) Dual Core Processor 4450e (AuthenticAMD 2300MHz) (x86_64/2 cpu) on linux - 3.0.0-1-amd64 [debian] using cc version 4.6.1 smoketime 43 minutes 42 seconds (average 43 minutes 42 seconds) Summary: FAIL(F) O = OK F = Failure(s), extended report at the bottom X = Failure(s) under TEST but not under harness ? = still running or test results not (yet) available Build failures during: - = unknown or N/A c = Configure, m ...

Smoke [5.15.1] v5.15.1-219-gea31ed6 FAIL(F) linux 3.0.0-1-amd64 [debian] (x86_64/2 cpu)
Automated smoke report for 5.15.1 patch ea31ed6697f4ec8ba9adbd2e965d8912bb223307 v5.15.1-219-gea31ed6 bandsman.dyndns-ip.com: AMD Athlon(tm) Dual Core Processor 4450e (AuthenticAMD 2300MHz) (x86_64/2 cpu) on linux - 3.0.0-1-amd64 [debian] using cc version 4.6.1 smoketime 48 minutes 16 seconds (average 48 minutes 16 seconds) Summary: FAIL(F) O = OK F = Failure(s), extended report at the bottom X = Failure(s) under TEST but not under harness ? = still running or test results not (yet) available Build failures during: - = unknown or N/A c = Configure, m...

Smoke [5.15.1] v5.15.1-322-gab6ce8e FAIL(F) linux 3.0.0-1-amd64 [debian] (x86_64/2 cpu)
Automated smoke report for 5.15.1 patch ab6ce8ea7f947e9b943e5ef57852b65f2ccd1f4c v5.15.1-322-gab6ce8e bandsman.dyndns-ip.com: AMD Athlon(tm) Dual Core Processor 4450e (AuthenticAMD 2300MHz) (x86_64/2 cpu) on linux - 3.0.0-1-amd64 [debian] using cc version 4.6.1 smoketime 49 minutes 12 seconds (average 49 minutes 12 seconds) Summary: FAIL(F) O = OK F = Failure(s), extended report at the bottom X = Failure(s) under TEST but not under harness ? = still running or test results not (yet) available Build failures during: - = unknown or N/A c = Configure, m...

Smoke [5.15.1] v5.15.1-87-g18e84e8 FAIL(F) linux 3.0.0-1-amd64 [debian] (x86_64/2 cpu)
Automated smoke report for 5.15.1 patch 18e84e8166b57276c5ac3cd4017c3afad5a039b3 v5.15.1-87-g18e84e8 bandsman.dyndns-ip.com: AMD Athlon(tm) Dual Core Processor 4450e (AuthenticAMD 2300MHz) (x86_64/2 cpu) on linux - 3.0.0-1-amd64 [debian] using cc version 4.6.1 smoketime 3 hours 5 minutes (average 3 hours 5 minutes) Summary: FAIL(F) O = OK F = Failure(s), extended report at the bottom X = Failure(s) under TEST but not under harness ? = still running or test results not (yet) available Build failures during: - = unknown or N/A c = Configure, m = make, ...

Smoke [5.15.1] v5.15.1-89-gf2e96b5 FAIL(F) linux 3.0.0-1-amd64 [debian] (x86_64/2 cpu)
Automated smoke report for 5.15.1 patch f2e96b5ddb6396417bc2fb71915c5025215060d6 v5.15.1-89-gf2e96b5 bandsman.dyndns-ip.com: AMD Athlon(tm) Dual Core Processor 4450e (AuthenticAMD 2300MHz) (x86_64/2 cpu) on linux - 3.0.0-1-amd64 [debian] using cc version 4.6.1 smoketime 1 hour 13 minutes (average 1 hour 13 minutes) Summary: FAIL(F) O = OK F = Failure(s), extended report at the bottom X = Failure(s) under TEST but not under harness ? = still running or test results not (yet) available Build failures during: - = unknown or N/A c = Configure, m = make, ...

Web resources about - Smoke [5.15.1] v5.15.1-236-ge0a28d1 FAIL(F) linux 3.0.0-1-amd64 [debian] (x86_64/2 cpu) - perl.perl5.porters

Cara Delevingne knows more about climate change than Donald Trump, also has better balance
On a recent visit to the White House, famous person Cara Delevingne left a message for one of its would-be inhabitants on her Instagram. Let's ...

iPhone 5se is what new overpriced Apple 4-incher is called
Apple iPhone 5se —that's what the upcoming small iPhone will be called. Not 6c, as everyone was expecting, and with a release date as early as ...

Ice Cube Dismisses Oscars Boycott: We Do Movies for the People, Not the Industry
One of the biggest #OscarsSoWhite complaints is that the critically-acclaimed film Straight Outta Compton was snubbed (save for a Best Original ...

East Coast Winter Storm Jonas Shutting Down Theaters
Movie theaters across the nation — and hence, the box office — are being affected by winter storm Jonas with D.C. completely shut down and closings ...

European authorities angered by VW's North American compensation program
Filed under: Government/Legal , Volkswagen , Diesel Volkswagen is under attack by European legislators after refusing to expand its US compensation ...

'Here's to Flint!' Flint's water disaster began with applause
Los Angeles Times 'Here's to Flint!' Flint's water disaster began with applause Los Angeles Times Pastor David Bullock holds up a bottle of ...

What would it mean if Apple joined the VR fray
Apple is making moves toward a play in virtual reality. If the tech giant strapped on a headset, here's what it would mean-especially for those ...

Skype to hide IP addresses by default, protecting gamers everywhere
Microsoft has rolled out a new version of the desktop Skype client that should make users of its service a little safer from denial-of-service ...

Editorial Cartoons: Stock market, China and oil prices
In this slideshow, we illustrate through cartoons the struggles on Wall Street the past few weeks and the main culprits are actually taking place ...

Google to pay £130 mn to Britain in back taxes
Technology giant Google is to pay £130 million (172 million euros, $185.4 million) in back taxes to Britain following a government inquiry into ...

Resources last updated: 1/23/2016 1:03:43 AM