Smoke [5.11.5] v5.11.5-91-g0fa4a26 FAIL(XF) netbsd 5.0.2 (i386/1 cpu)

Automated smoke report for 5.11.5 patch 0fa4a26596a4646f9aae1dcd199a2f30933e6f01 v5.11.5-91-g0fa4a26
p5netbsd: Intel 686-class (i386/1 cpu)
    on        netbsd - 5.0.2
    using     cc version 4.1.3 20080704 prerelease (NetBSD nb2 20081120)
    smoketime 6 hours 34 minutes (average 49 minutes 17 seconds)

Summary: FAIL(XF)

O = OK  F = Failure(s), extended report at the bottom
X = Failure(s) under TEST but not under harness
? = still running or test results not (yet) available
Build failures during:       - = unknown or N/A
c = Configure, m = make, M = make (after miniperl), t = make test-prep

v5.11.5-91-g0fa4a26  Configuration (common) none
----------- ---------------------------------------------------------
X X X X     
X X X X     -Duse64bitint
O O O O     -Duseithreads
F O O O     -Duseithreads -Duse64bitint
| | | +----- PERLIO = perlio -DDEBUGGING
| | +------- PERLIO = stdio  -DDEBUGGING
| +--------- PERLIO = perlio
+----------- PERLIO = stdio


Locally applied patches:
    uncommitted-changes
    SMOKE0fa4a26596a4646f9aae1dcd199a2f30933e6f01

Failures: (common-args) none
[stdio/perlio] 
[perlio] -DDEBUGGING
[stdio/perlio] -Duse64bitint
[stdio/perlio] -DDEBUGGING -Duse64bitint
Inconsistent test results (between TEST and harness):
    ../t/dist/B-Deparse/t/deparse.t.........FAILED at test 61

[stdio] -DDEBUGGING
Inconsistent test results (between TEST and harness):
    ../t/dist/B-Deparse/t/deparse.t.........FAILED at test 61
    ../t/op/rand.t..........................FAILED at test 5

[stdio] -Duseithreads -Duse64bitint
    ../lib/Benchmark.t..........................................FAILED
        126-127
        Non-zero exit status: 2

Compiler messages(gcc):
perlio.c: In function 'PerlIOStdio_set_ptrcnt':
perlio.c:3437: warning: pointer targets in assignment differ in signedness
/usr/include/sys/cdefs_elf.h:67:20: error: missing binary operator before token "("
<command line>:1:1: warning: "TIME_HIRES_STAT" redefined
<command line>:1:1: warning: this is the location of the previous definition
APItest.xs: In function 'XS_XS__APItest_pmflag':
APItest.xs:930: warning: 'Perl_pmflag' is deprecated (declared at ../../proto.h:2622)

-- 
Report by Test::Smoke v1.43 build 1271 running on perl 5.10.1
(Reporter v0.035 / Smoker v0.045)
0
stsc
3/11/2010 5:20:43 AM
perl.perl5.porters 48287 articles. 1 followers. Follow

0 Replies
795 Views

Similar Articles

[PageSpeed] 4
Get it on Google Play
Get it on Apple App Store

Reply:

Similar Artilces:

Smoke [5.11.5] v5.11.5-51-gb09c05e FAIL(XF) netbsd 5.0.2 (i386/1 cpu)
Automated smoke report for 5.11.5 patch b09c05e65698d8bad3544ae2c60fdbf601f0fa72 v5.11.5-51-gb09c05e p5netbsd: Intel 686-class (i386/1 cpu) on netbsd - 5.0.2 using cc version 4.1.3 20080704 prerelease (NetBSD nb2 20081120) smoketime 6 hours 35 minutes (average 49 minutes 26 seconds) Summary: FAIL(XF) O = OK F = Failure(s), extended report at the bottom X = Failure(s) under TEST but not under harness ? = still running or test results not (yet) available Build failures during: - = unknown or N/A c = Configure, m = make, M = make (after miniperl), t = m...

Smoke [5.11.5] v5.11.5-89-gab8e66c FAIL(XF) netbsd 5.0.2 (i386/1 cpu)
Automated smoke report for 5.11.5 patch ab8e66c141d8d7d892995deba69405e747204cf0 v5.11.5-89-gab8e66c p5netbsd: Intel 686-class (i386/1 cpu) on netbsd - 5.0.2 using cc version 4.1.3 20080704 prerelease (NetBSD nb2 20081120) smoketime 6 hours 40 minutes (average 50 minutes 3 seconds) Summary: FAIL(XF) O = OK F = Failure(s), extended report at the bottom X = Failure(s) under TEST but not under harness ? = still running or test results not (yet) available Build failures during: - = unknown or N/A c = Configure, m = make, M = make (after miniperl), t = ma...

Smoke [5.11.5] v5.11.5-82-g79b7484 FAIL(XF) netbsd 5.0.2 (i386/1 cpu)
Automated smoke report for 5.11.5 patch 79b7484367aeaeee65e60704dd06273cfca231b9 v5.11.5-82-g79b7484 p5netbsd: Intel 686-class (i386/1 cpu) on netbsd - 5.0.2 using cc version 4.1.3 20080704 prerelease (NetBSD nb2 20081120) smoketime 6 hours 37 minutes (average 49 minutes 43 seconds) Summary: FAIL(XF) O = OK F = Failure(s), extended report at the bottom X = Failure(s) under TEST but not under harness ? = still running or test results not (yet) available Build failures during: - = unknown or N/A c = Configure, m = make, M = make (after miniperl), t = m...

Smoke [5.11.5] v5.11.5-27-ga42901a FAIL(XM) netbsd 5.0.2 (i386/1 cpu)
Automated smoke report for 5.11.5 patch a42901aff3d8b1b6b3eecdf30fe579a4456c4ca8 v5.11.5-27-ga42901a p5netbsd: Intel 686-class (i386/1 cpu) on netbsd - 5.0.2 using cc version 4.1.3 20080704 prerelease (NetBSD nb2 20081120) smoketime 5 hours 50 minutes (average 43 minutes 51 seconds) Summary: FAIL(XM) O = OK F = Failure(s), extended report at the bottom X = Failure(s) under TEST but not under harness ? = still running or test results not (yet) available Build failures during: - = unknown or N/A c = Configure, m = make, M = make (after miniperl), t = m...

Smoke [5.11.2] v5.11.2-160-g421f30e FAIL(XF) netbsd 5.0.1 (i386/1 cpu)
Automated smoke report for 5.11.2 patch 421f30ed1e95009450bdc7905bf3433ee806ea4f v5.11.2-160-g421f30e p5netbsd: Intel 686-class (i386/1 cpu) on netbsd - 5.0.1 using cc version 4.1.3 20080704 prerelease (NetBSD nb2 20081120) smoketime 7 hours 7 minutes (average 53 minutes 26 seconds) Summary: FAIL(XF) O = OK F = Failure(s), extended report at the bottom X = Failure(s) under TEST but not under harness ? = still running or test results not (yet) available Build failures during: - = unknown or N/A c = Configure, m = make, M = make (after miniperl), t = m...

Smoke [5.11.3] v5.11.3-5-g27bca32 FAIL(XF) netbsd 5.0.1 (i386/1 cpu)
Automated smoke report for 5.11.3 patch 27bca3226281a592aed848b7e68ea50f27381dac v5.11.3-5-g27bca32 p5netbsd: Intel 686-class (i386/1 cpu) on netbsd - 5.0.1 using cc version 4.1.3 20080704 prerelease (NetBSD nb2 20081120) smoketime 6 hours 44 minutes (average 50 minutes 37 seconds) Summary: FAIL(XF) O = OK F = Failure(s), extended report at the bottom X = Failure(s) under TEST but not under harness ? = still running or test results not (yet) available Build failures during: - = unknown or N/A c = Configure, m = make, M = make (after miniperl), t = ma...

Smoke [5.11.4] v5.11.4-91-g555dc08 FAIL(XF) netbsd 5.0.2 (i386/1 cpu)
Automated smoke report for 5.11.4 patch 555dc087e23cb8cb4cb1c91e73f10b9b9bf80630 v5.11.4-91-g555dc08 p5netbsd: Intel 686-class (i386/1 cpu) on netbsd - 5.0.2 using cc version 4.1.3 20080704 prerelease (NetBSD nb2 20081120) smoketime 6 hours 30 minutes (average 48 minutes 47 seconds) Summary: FAIL(XF) O = OK F = Failure(s), extended report at the bottom X = Failure(s) under TEST but not under harness ? = still running or test results not (yet) available Build failures during: - = unknown or N/A c = Configure, m = make, M = make (after miniperl), t = m...

Smoke [5.12.0] v5.11.5-139-g18d7fc8 FAIL(XF) netbsd 5.0.2 (i386/1 cpu)
Automated smoke report for 5.12.0 patch 18d7fc8581bb4210d9ffa89f034b1895f1df9ab6 v5.11.5-139-g18d7fc8 p5netbsd: Intel 686-class (i386/1 cpu) on netbsd - 5.0.2 using cc version 4.1.3 20080704 prerelease (NetBSD nb2 20081120) smoketime 6 hours 34 minutes (average 49 minutes 18 seconds) Summary: FAIL(XF) O = OK F = Failure(s), extended report at the bottom X = Failure(s) under TEST but not under harness ? = still running or test results not (yet) available Build failures during: - = unknown or N/A c = Configure, m = make, M = make (after miniperl), t = ...

Smoke [5.12.0] v5.11.5-127-gf675f1f FAIL(XF) netbsd 5.0.2 (i386/1 cpu)
Automated smoke report for 5.12.0 patch f675f1f1c6a363389a76068fa2c93c8c64cdf9e0 v5.11.5-127-gf675f1f p5netbsd: Intel 686-class (i386/1 cpu) on netbsd - 5.0.2 using cc version 4.1.3 20080704 prerelease (NetBSD nb2 20081120) smoketime 6 hours 38 minutes (average 49 minutes 49 seconds) Summary: FAIL(XF) O = OK F = Failure(s), extended report at the bottom X = Failure(s) under TEST but not under harness ? = still running or test results not (yet) available Build failures during: - = unknown or N/A c = Configure, m = make, M = make (after miniperl), t = ...

Smoke [5.12.0] v5.11.5-135-g8a4f3f1 FAIL(XF) netbsd 5.0.2 (i386/1 cpu)
Automated smoke report for 5.12.0 patch 8a4f3f1418b323a0223261873d8a0d07fd3098d8 v5.11.5-135-g8a4f3f1 p5netbsd: Intel 686-class (i386/1 cpu) on netbsd - 5.0.2 using cc version 4.1.3 20080704 prerelease (NetBSD nb2 20081120) smoketime 6 hours 34 minutes (average 49 minutes 20 seconds) Summary: FAIL(XF) O = OK F = Failure(s), extended report at the bottom X = Failure(s) under TEST but not under harness ? = still running or test results not (yet) available Build failures during: - = unknown or N/A c = Configure, m = make, M = make (after miniperl), t = ...

Smoke [5.12.0] v5.11.5-140-g79f7885 FAIL(XF) netbsd 5.0.2 (i386/1 cpu)
Automated smoke report for 5.12.0 patch 79f7885ca13814e1bf32fa15901b6f0cdc95f9be v5.11.5-140-g79f7885 p5netbsd: Intel 686-class (i386/1 cpu) on netbsd - 5.0.2 using cc version 4.1.3 20080704 prerelease (NetBSD nb2 20081120) smoketime 6 hours 35 minutes (average 49 minutes 24 seconds) Summary: FAIL(XF) O = OK F = Failure(s), extended report at the bottom X = Failure(s) under TEST but not under harness ? = still running or test results not (yet) available Build failures during: - = unknown or N/A c = Configure, m = make, M = make (after miniperl), t = ...

Smoke [5.11.0] v5.11.0-17-g28e464f FAIL(XF) netbsd 5.0.1 (i386/1 cpu)
Automated smoke report for 5.11.0 patch 28e464fba839d02f376952199261fc8b7d58a0d8 v5.11.0-17-g28e464f p5netbsd: Intel 686-class (i386/1 cpu) on netbsd - 5.0.1 using cc version 4.1.3 20080704 prerelease (NetBSD nb2 20081120) smoketime 7 hours 52 minutes (average 59 minutes 3 seconds) Summary: FAIL(XF) O = OK F = Failure(s), extended report at the bottom X = Failure(s) under TEST but not under harness ? = still running or test results not (yet) available Build failures during: - = unknown or N/A c = Configure, m = make, M = make (after miniperl), t = ma...

Smoke [5.11.0] v5.11.0-49-g5b7d14f FAIL(XF) netbsd 5.0.1 (i386/1 cpu)
Automated smoke report for 5.11.0 patch 5b7d14ffe3988c7f70fd9dc76be9c44168d17a62 v5.11.0-49-g5b7d14f p5netbsd: Intel 686-class (i386/1 cpu) on netbsd - 5.0.1 using cc version 4.1.3 20080704 prerelease (NetBSD nb2 20081120) smoketime 8 hours 10 minutes (average 1 hour 1 minute) Summary: FAIL(XF) O = OK F = Failure(s), extended report at the bottom X = Failure(s) under TEST but not under harness ? = still running or test results not (yet) available Build failures during: - = unknown or N/A c = Configure, m = make, M = make (after miniperl), t = make te...

Smoke [5.11.1] v5.11.1-227-gedb47d5 FAIL(XF) netbsd 5.0.1 (i386/1 cpu)
Automated smoke report for 5.11.1 patch edb47d5e45750eb7ab61981e15a22f43672ff4f4 v5.11.1-227-gedb47d5 p5netbsd: Intel 686-class (i386/1 cpu) on netbsd - 5.0.1 using cc version 4.1.3 20080704 prerelease (NetBSD nb2 20081120) smoketime 6 hours 42 minutes (average 50 minutes 20 seconds) Summary: FAIL(XF) O = OK F = Failure(s), extended report at the bottom X = Failure(s) under TEST but not under harness ? = still running or test results not (yet) available Build failures during: - = unknown or N/A c = Configure, m = make, M = make (after miniperl), t = ...

Web resources about - Smoke [5.11.5] v5.11.5-91-g0fa4a26 FAIL(XF) netbsd 5.0.2 (i386/1 cpu) - perl.perl5.porters

Art Garfunkel Explains Why He Approved Bernie Sanders’ Use of ‘America’
Art Garfunkel issued a statement on Friday explaining why he gave his approval to the campaign of Bernie Sanders to use the Simon & Garfunkel ...

Samsung vs Apple in a deli payment war
This week the folks at Samsung have decided to take Apple to task on Apple Pay vs Samsung Pay in an video spot with comedian Hannibal Buress. ...

Michael Caine on #OscarsSoWhite: Black actors should 'be patient'
Add Michael Caine to the growing list of celebrities weighing in on the #OscarsSoWhite controversy The Oscar winner gave his thoughts about ...

Police Officer Indicted in Shooting of Unarmed Black Man
A white Atlanta-area police officer who shot a naked, mentally ill black veteran who was unarmed has been indicted on felony murder and other ...

Weekend Storm Watch: What Travelers Need to Know
Thousands of flights have already been cancelled.

Anonymous Launches Campaign Against Michigan Governor for Poison Water Crisis
As Michigan governor Rick Synder continues to face criticism for his handling of the polluted water crisis griping the city of Flint, the hactivist ...

US stocks join global rally as energy prices jump again
U.S. stocks are jumping Friday as a rally that started in Asia reaches America and energy prices continue to climb from their recent lows, lifting ...

Apple just hired a leading VR expert, which could mean a ‘VRKit’ is in the works
A new report from The Financial Times suggests Apple has hired Doug Bowman, a leading researcher in the field of virtual reality. Before landing ...

Somali Security Forces End Siege At Beachfront Restaurant; At Least 20 Dead
Huffington Post Somali Security Forces End Siege At Beachfront Restaurant; At Least 20 Dead Huffington Post Witnesses said that gunmen shouted ...

North Korea Holding American UVa Student for "Hostile Act"
The New York Times reports that an American college student has been detained in North Korea after allegedly committing a “hostile act” while ...

Resources last updated: 1/22/2016 7:05:18 PM