Smoke [5.11.1] v5.11.1-187-g968682b FAIL(XF) netbsd 5.0.1 (i386/1 cpu)

Automated smoke report for 5.11.1 patch 968682bce14e5963abd216113468bc07e01bce0f v5.11.1-187-g968682b
p5netbsd: Intel 686-class (i386/1 cpu)
    on        netbsd - 5.0.1
    using     cc version 4.1.3 20080704 prerelease (NetBSD nb2 20081120)
    smoketime 6 hours 42 minutes (average 50 minutes 21 seconds)

Summary: FAIL(XF)

O = OK  F = Failure(s), extended report at the bottom
X = Failure(s) under TEST but not under harness
? = still running or test results not (yet) available
Build failures during:       - = unknown or N/A
c = Configure, m = make, M = make (after miniperl), t = make test-prep

v5.11.1-187-g968682b  Configuration (common) none
----------- ---------------------------------------------------------
O O O O     
O O O X     -Duse64bitint
F F O O     -Duseithreads
F F O O     -Duseithreads -Duse64bitint
| | | +----- PERLIO = perlio -DDEBUGGING
| | +------- PERLIO = stdio  -DDEBUGGING
| +--------- PERLIO = perlio
+----------- PERLIO = stdio


Locally applied patches:
    SMOKE968682bce14e5963abd216113468bc07e01bce0f

Failures: (common-args) none
[perlio] -DDEBUGGING -Duse64bitint
Inconsistent test results (between TEST and harness):
    ../lib/Benchmark.t......................FAILED at test 126

[stdio/perlio] -Duseithreads
    ../ext/re/t/lexical_debug.t.................................FAILED
        7-10
    ../ext/re/t/regop.t.........................................FAILED
        1, 3-4, 8-12, 19
        Bad plan.  You planned 48 tests but ran 19.

[stdio] -Duseithreads -Duse64bitint
    ../ext/re/t/lexical_debug.t.................................FAILED
        7-10
    ../ext/re/t/regop.t.........................................FAILED
        1, 3-4, 8-12, 19
        Bad plan.  You planned 48 tests but ran 19.
Inconsistent test results (between TEST and harness):
    ../lib/Benchmark.t......................FAILED at test 127

[perlio] -Duseithreads -Duse64bitint
    ../ext/re/t/lexical_debug.t.................................FAILED
        7-10
    ../ext/re/t/regop.t.........................................FAILED
        1, 3-4, 8-12, 19
        Bad plan.  You planned 48 tests but ran 19.
Inconsistent test results (between TEST and harness):
    ../lib/Benchmark.t......................FAILED at test 126

Compiler messages(gcc):
pp.c: In function 'Perl_pp_delete':
pp.c:4297: warning: 'sv' may be used uninitialized in this function
scope.c:96:8: warning: extra tokens at end of #endif directive
pp_ctl.c: In function 'Perl_pp_last':
pp_ctl.c:2214: warning: 'nextop' may be used uninitialized in this function
pp_ctl.c: In function 'Perl_pp_return':
pp_ctl.c:2092: warning: 'retop' may be used uninitialized in this function
pp_sys.c: In function 'Perl_pp_dbmopen':
pp_sys.c:936: warning: 'gv' may be used uninitialized in this function
pp_sys.c: In function 'Perl_pp_tie':
pp_sys.c:788: warning: 'gv' may be used uninitialized in this function
perlio.c: In function 'PerlIOStdio_set_ptrcnt':
perlio.c:3437: warning: pointer targets in assignment differ in signedness
/usr/include/sys/cdefs_elf.h:67:20: error: missing binary operator before token "("
<command line>:1:1: warning: "TIME_HIRES_STAT" redefined
<command line>:1:1: warning: this is the location of the previous definition
APItest.xs: In function 'XS_XS__APItest_pmflag':
APItest.xs:930: warning: 'Perl_pmflag' is deprecated (declared at ../../proto.h:2517)
op.c: In function 'Perl_newATTRSUB':
op.c:5778: warning: cast from pointer to integer of different size

-- 
Report by Test::Smoke v1.40 build 1242 running on perl 5.10.0
(Reporter v0.035 / Smoker v0.044)
0
stsc
11/13/2009 5:35:18 AM
perl.perl5.porters 48287 articles. 1 followers. Follow

0 Replies
847 Views

Similar Articles

[PageSpeed] 52

Reply: