Smoke [5.11.0] v5.11.0-74-g9e7c6af FAIL(F) openbsd 4.5 (i386/1 cpu)

Automated smoke report for 5.11.0 patch 9e7c6af37d3320462cbceb74b487ade8224b9191 v5.11.0-74-g9e7c6af
p5openbsd: AMD Athlon(tm) Processor ("AuthenticAMD" 686-class, 256KB L2 cache) (909 MHz) (i386/1 cpu)
    on        openbsd - 4.5
    using     cc version 3.3.5 (propolice)
    smoketime 12 hours 57 minutes (average 1 hour 37 minutes)

Summary: FAIL(F)

O = OK  F = Failure(s), extended report at the bottom
X = Failure(s) under TEST but not under harness
? = still running or test results not (yet) available
Build failures during:       - = unknown or N/A
c = Configure, m = make, M = make (after miniperl), t = make test-prep

v5.11.0-74-g9e7c6af  Configuration (common) none
----------- ---------------------------------------------------------
F F F F     
F F F F     -Duse64bitint
F F F F     -Duseithreads
F F F F     -Duseithreads -Duse64bitint
| | | +----- PERLIO = perlio -DDEBUGGING
| | +------- PERLIO = stdio  -DDEBUGGING
| +--------- PERLIO = perlio
+----------- PERLIO = stdio


Locally applied patches:
    SMOKE9e7c6af37d3320462cbceb74b487ade8224b9191

Failures: (common-args) none
[stdio/perlio] 
[stdio/perlio] -DDEBUGGING
[stdio/perlio] -Duse64bitint
[stdio/perlio] -DDEBUGGING -Duse64bitint
    ../lib/File/Copy.t..........................................FAILED
        Bad plan.  You planned 461 tests but ran 82.
    ../t/re/pat_special_cc.t....................................FAILED
        1, 4, 7

[stdio/perlio] -Duseithreads
[stdio/perlio] -DDEBUGGING -Duseithreads
[stdio/perlio] -Duseithreads -Duse64bitint
[perlio] -DDEBUGGING -Duseithreads -Duse64bitint
    ../lib/File/Copy.t..........................................FAILED
        Bad plan.  You planned 461 tests but ran 82.
    ../t/re/pat_special_cc.t....................................FAILED
        1, 4, 7
    ../t/re/pat_special_cc_thr.t................................FAILED
        1, 4, 7

[stdio] -DDEBUGGING -Duseithreads -Duse64bitint
    ../lib/File/Copy.t..........................................FAILED
        Bad plan.  You planned 461 tests but ran 82.
    ../t/re/pat_special_cc.t....................................FAILED
        1, 4, 7
    ../t/re/pat_special_cc_thr.t................................FAILED
        1, 4, 7
Inconsistent test results (between TEST and harness):
    ../t/io/errno.t.........................FAILED at test 11

Compiler messages(gcc):
Configure .../tmp//ccgjxZku.o(.text+0x3e): In function `main':
/tmp//ccTCSfhj.o(.text+0x5d): In function `main':
/tmp//ccVBPQRd.o(.text+0x1c): In function `xxx':
/tmp//ccdNzApg.o(.text+0xde): In function `main':
sv.o(.text+0x1d8b): In function `Perl_sv_2pv_flags':
libperl.a(DynaLoader.o)(.text+0x242): In function `XS_DynaLoader_dl_load_file':
libperl.a(sv.o)(.text+0x1d8b): In function `Perl_sv_2pv_flags':
<command line>:12:1: warning: "TIME_HIRES_STAT" redefined
<command line>:11:1: warning: this is the location of the previous definition
<command line>:13:1: warning: "TIME_HIRES_STAT" redefined
<command line>:12:1: warning: this is the location of the previous definition
util.o(.text+0x1b3): In function `savestr':
str.o(.text+0x5d): In function `str_2ptr':
.../libperl.a(sv.o)(.text+0x1d8b): In function `Perl_sv_2pv_flags':
Configure .../tmp//ccmRwZut.o(.text+0x3e): In function `main':
/home/sts/source/p5-current/UU/try.c:20: warning: sprintf() is often misused, please use snprintf()
/tmp//ccxYpANg.o(.text+0x5d): In function `main':
/home/sts/source/p5-current/UU/try.c:29: warning: sprintf() is often misused, please use snprintf()
/tmp//ccwVeriy.o(.text+0x1c): In function `xxx':
/home/sts/source/p5-current/UU/try.c:29: warning: vsprintf() is often misused, please use vsnprintf()
/tmp//ccRSzLHs.o(.text+0xde): In function `main':
/home/sts/source/p5-current/UU/try.c:52: warning: sprintf() is often misused, please use snprintf()
sv.o(.text+0xb7ff): In function `Perl_sv_2pv_flags':
/home/sts/source/p5-current/sv.c:2774: warning: sprintf() is often misused, please use snprintf()
libperl.a(DynaLoader.o)(.text+0x556): In function `XS_DynaLoader_dl_load_file':
/home/sts/source/p5-current/ext/DynaLoader/DynaLoader.xs:171: warning: strcat() is almost always misused, please use strlcat()
libperl.a(sv.o)(.text+0xb7ff): In function `Perl_sv_2pv_flags':
<command line>:14:1: warning: "TIME_HIRES_STAT" redefined
<command line>:13:1: warning: this is the location of the previous definition
<command line>:15:1: warning: "TIME_HIRES_STAT" redefined
<command line>:14:1: warning: this is the location of the previous definition
util.o(.text+0x283): In function `savestr':
/home/sts/source/p5-current/x2p/util.c:147: warning: strcpy() is almost always misused, please use strlcpy()
str.o(.text+0x81): In function `str_2ptr':
/home/sts/source/p5-current/x2p/str.c:32: warning: sprintf() is often misused, please use snprintf()
.../libperl.a(sv.o)(.text+0xb7ff): In function `Perl_sv_2pv_flags':
Configure .../tmp//ccnWgiYF.o(.text+0x3e): In function `main':
/tmp//cceVkacT.o(.text+0x5d): In function `main':
/tmp//ccXRzzzR.o(.text+0x1c): In function `xxx':
/tmp//ccsRffXo.o(.text+0xde): In function `main':
sv.o(.text+0x224f): In function `Perl_sv_2pv_flags':
libperl.a(sv.o)(.text+0x224f): In function `Perl_sv_2pv_flags':
.../libperl.a(sv.o)(.text+0x224f): In function `Perl_sv_2pv_flags':
Configure .../tmp//cculiiDo.o(.text+0x3e): In function `main':
/tmp//ccDwknVQ.o(.text+0x5d): In function `main':
/tmp//ccWRTStj.o(.text+0x1c): In function `xxx':
/tmp//ccalWtII.o(.text+0xde): In function `main':
sv.o(.text+0xac26): In function `Perl_sv_2pv_flags':
libperl.a(DynaLoader.o)(.text+0x55a): In function `XS_DynaLoader_dl_load_file':
libperl.a(sv.o)(.text+0xac26): In function `Perl_sv_2pv_flags':
.../libperl.a(sv.o)(.text+0xac26): In function `Perl_sv_2pv_flags':
Configure .../tmp//ccWCUbpM.o(.text+0x3e): In function `main':
/tmp//ccUDWMZw.o(.text+0x5d): In function `main':
/tmp//ccxHjXiI.o(.text+0x1c): In function `xxx':
/tmp//ccvrJzbl.o(.text+0xde): In function `main':
sv.o(.text+0x1ee7): In function `Perl_sv_2pv_flags':
libperl.a(DynaLoader.o)(.text+0x4aa): In function `XS_DynaLoader_dl_load_file':
libperl.a(sv.o)(.text+0x1ee7): In function `Perl_sv_2pv_flags':
.../libperl.a(sv.o)(.text+0x1ee7): In function `Perl_sv_2pv_flags':
Configure .../tmp//cccqigag.o(.text+0x3e): In function `main':
/tmp//ccjJPDhM.o(.text+0x5d): In function `main':
/tmp//ccpsvzxa.o(.text+0x1c): In function `xxx':
/tmp//ccqKULqj.o(.text+0xde): In function `main':
sv.o(.text+0xba3b): In function `Perl_sv_2pv_flags':
libperl.a(DynaLoader.o)(.text+0x8de): In function `XS_DynaLoader_dl_load_file':
libperl.a(sv.o)(.text+0xba3b): In function `Perl_sv_2pv_flags':
<command line>:16:1: warning: "TIME_HIRES_STAT" redefined
<command line>:15:1: warning: this is the location of the previous definition
.../libperl.a(sv.o)(.text+0xba3b): In function `Perl_sv_2pv_flags':
Configure .../tmp//ccIeWgNH.o(.text+0x3e): In function `main':
/tmp//ccRCNYYa.o(.text+0x5d): In function `main':
/tmp//cczhRDrY.o(.text+0x1c): In function `xxx':
/tmp//ccetysSl.o(.text+0xde): In function `main':
sv.o(.text+0x239b): In function `Perl_sv_2pv_flags':
libperl.a(sv.o)(.text+0x239b): In function `Perl_sv_2pv_flags':
.../libperl.a(sv.o)(.text+0x239b): In function `Perl_sv_2pv_flags':
Configure .../tmp//ccjivWCo.o(.text+0x3e): In function `main':
/tmp//ccMKkWvQ.o(.text+0x5d): In function `main':
/tmp//ccqaCqpi.o(.text+0x1c): In function `xxx':
/tmp//ccLShBLD.o(.text+0xde): In function `main':
sv.o(.text+0xaebe): In function `Perl_sv_2pv_flags':
libperl.a(sv.o)(.text+0xaebe): In function `Perl_sv_2pv_flags':
.../libperl.a(sv.o)(.text+0xaebe): In function `Perl_sv_2pv_flags':

-- 
Report by Test::Smoke v1.40 build 1242 running on perl 5.10.0
(Reporter v0.035 / Smoker v0.044)
0
stsc
10/9/2009 11:14:08 AM
perl.perl5.porters 48287 articles. 1 followers. Follow

0 Replies
558 Views

Similar Articles

[PageSpeed] 32

Reply:

Similar Artilces:

Smoke [5.11.0] v5.11.0-74-g9e7c6af FAIL(F) netbsd 5.0.1 (i386/1 cpu)
Automated smoke report for 5.11.0 patch 9e7c6af37d3320462cbceb74b487ade8224b9191 v5.11.0-74-g9e7c6af p5netbsd: Intel 686-class (i386/1 cpu) on netbsd - 5.0.1 using cc version 4.1.3 20080704 prerelease (NetBSD nb2 20081120) smoketime 8 hours 32 minutes (average 1 hour 4 minutes) Summary: FAIL(F) O = OK F = Failure(s), extended report at the bottom X = Failure(s) under TEST but not under harness ? = still running or test results not (yet) available Build failures during: - = unknown or N/A c = Configure, m = make, M = make (after miniperl), t = make te...

Smoke [5.11.0] v5.11.0-1-g9911515 FAIL(F) openbsd 4.5 (i386/1 cpu)
Automated smoke report for 5.11.0 patch 99115150e3b424e330d9007fc4005e056210f907 v5.11.0-1-g9911515 p5openbsd: AMD Athlon(tm) Processor ("AuthenticAMD" 686-class, 256KB L2 cache) (909 MHz) (i386/1 cpu) on openbsd - 4.5 using cc version 3.3.5 (propolice) smoketime 12 hours 44 minutes (average 1 hour 35 minutes) Summary: FAIL(F) O = OK F = Failure(s), extended report at the bottom X = Failure(s) under TEST but not under harness ? = still running or test results not (yet) available Build failures during: - = unknown or N/A c = Configure, m = m...

Smoke [5.11.0] v5.11.0-106-g09a3ed3 FAIL(F) openbsd 4.5 (i386/1 cpu)
Automated smoke report for 5.11.0 patch 09a3ed31a73051acd8ed0511ea0d927d9660fd22 v5.11.0-106-g09a3ed3 p5openbsd: AMD Athlon(tm) Processor ("AuthenticAMD" 686-class, 256KB L2 cache) (909 MHz) (i386/1 cpu) on openbsd - 4.5 using cc version 3.3.5 (propolice) smoketime 12 hours 58 minutes (average 1 hour 37 minutes) Summary: FAIL(F) O = OK F = Failure(s), extended report at the bottom X = Failure(s) under TEST but not under harness ? = still running or test results not (yet) available Build failures during: - = unknown or N/A c = Configure, m =...

Smoke [5.11.0] v5.11.0-103-g1cce990 FAIL(F) openbsd 4.5 (i386/1 cpu)
Automated smoke report for 5.11.0 patch 1cce9906401b8a2db10f2d0061757627ad69f138 v5.11.0-103-g1cce990 p5openbsd: AMD Athlon(tm) Processor ("AuthenticAMD" 686-class, 256KB L2 cache) (909 MHz) (i386/1 cpu) on openbsd - 4.5 using cc version 3.3.5 (propolice) smoketime 12 hours 59 minutes (average 1 hour 37 minutes) Summary: FAIL(F) O = OK F = Failure(s), extended report at the bottom X = Failure(s) under TEST but not under harness ? = still running or test results not (yet) available Build failures during: - = unknown or N/A c = Configure, m =...

Smoke [5.11.0] v5.11.0-12-gb9fb583 FAIL(F) openbsd 4.5 (i386/1 cpu)
Automated smoke report for 5.11.0 patch b9fb583619490a0ded37e01402169cea64f6c91e v5.11.0-12-gb9fb583 p5openbsd: AMD Athlon(tm) Processor ("AuthenticAMD" 686-class, 256KB L2 cache) (909 MHz) (i386/1 cpu) on openbsd - 4.5 using cc version 3.3.5 (propolice) smoketime 12 hours 45 minutes (average 1 hour 35 minutes) Summary: FAIL(F) O = OK F = Failure(s), extended report at the bottom X = Failure(s) under TEST but not under harness ? = still running or test results not (yet) available Build failures during: - = unknown or N/A c = Configure, m = ...

Smoke [5.11.0] v5.11.0-31-g2d5f1d0 FAIL(F) openbsd 4.5 (i386/1 cpu)
Automated smoke report for 5.11.0 patch 2d5f1d01166a325b29ccc86102d26e68def13786 v5.11.0-31-g2d5f1d0 p5openbsd: AMD Athlon(tm) Processor ("AuthenticAMD" 686-class, 256KB L2 cache) (909 MHz) (i386/1 cpu) on openbsd - 4.5 using cc version 3.3.5 (propolice) smoketime 12 hours 43 minutes (average 1 hour 35 minutes) Summary: FAIL(F) O = OK F = Failure(s), extended report at the bottom X = Failure(s) under TEST but not under harness ? = still running or test results not (yet) available Build failures during: - = unknown or N/A c = Configure, m = ...

Smoke [5.11.0] v5.11.0-177-g63d690b FAIL(F) openbsd 4.5 (i386/1 cpu)
Automated smoke report for 5.11.0 patch 63d690b1f5b7e4a4f5cefe645e21a96651cbe9c2 v5.11.0-177-g63d690b p5openbsd: AMD Athlon(tm) Processor ("AuthenticAMD" 686-class, 256KB L2 cache) (909 MHz) (i386/1 cpu) on openbsd - 4.5 using cc version 3.3.5 (propolice) smoketime 12 hours 57 minutes (average 1 hour 37 minutes) Summary: FAIL(F) O = OK F = Failure(s), extended report at the bottom X = Failure(s) under TEST but not under harness ? = still running or test results not (yet) available Build failures during: - = unknown or N/A c = Configure, m =...

Smoke [5.11.0] v5.11.0-169-g50e225a FAIL(F) openbsd 4.5 (i386/1 cpu)
Automated smoke report for 5.11.0 patch 50e225a377de7c314b13cbaf39b6b423215d84a7 v5.11.0-169-g50e225a p5openbsd: AMD Athlon(tm) Processor ("AuthenticAMD" 686-class, 256KB L2 cache) (909 MHz) (i386/1 cpu) on openbsd - 4.5 using cc version 3.3.5 (propolice) smoketime 12 hours 55 minutes (average 1 hour 36 minutes) Summary: FAIL(F) O = OK F = Failure(s), extended report at the bottom X = Failure(s) under TEST but not under harness ? = still running or test results not (yet) available Build failures during: - = unknown or N/A c = Configure, m =...

Smoke [5.11.0] v5.11.0-219-g26c80ad FAIL(F) openbsd 4.5 (i386/1 cpu)
Automated smoke report for 5.11.0 patch 26c80adcc7731c0e4f1238e98e85fa2803538817 v5.11.0-219-g26c80ad p5openbsd: AMD Athlon(tm) Processor ("AuthenticAMD" 686-class, 256KB L2 cache) (909 MHz) (i386/1 cpu) on openbsd - 4.5 using cc version 3.3.5 (propolice) smoketime 12 hours 58 minutes (average 1 hour 37 minutes) Summary: FAIL(F) O = OK F = Failure(s), extended report at the bottom X = Failure(s) under TEST but not under harness ? = still running or test results not (yet) available Build failures during: - = unknown or N/A c = Configure, m =...

Smoke [5.11.0] v5.11.0-54-g68cbce5 FAIL(F) openbsd 4.5 (i386/1 cpu)
Automated smoke report for 5.11.0 patch 68cbce50efee2c3ae424cfe29c83b65d5b462b69 v5.11.0-54-g68cbce5 p5openbsd: AMD Athlon(tm) Processor ("AuthenticAMD" 686-class, 256KB L2 cache) (909 MHz) (i386/1 cpu) on openbsd - 4.5 using cc version 3.3.5 (propolice) smoketime 12 hours 58 minutes (average 1 hour 37 minutes) Summary: FAIL(F) O = OK F = Failure(s), extended report at the bottom X = Failure(s) under TEST but not under harness ? = still running or test results not (yet) available Build failures during: - = unknown or N/A c = Configure, m = ...

Smoke [5.11.0] v5.11.0-17-g28e464f FAIL(F) openbsd 4.5 (i386/1 cpu)
Automated smoke report for 5.11.0 patch 28e464fba839d02f376952199261fc8b7d58a0d8 v5.11.0-17-g28e464f p5openbsd: AMD Athlon(tm) Processor ("AuthenticAMD" 686-class, 256KB L2 cache) (909 MHz) (i386/1 cpu) on openbsd - 4.5 using cc version 3.3.5 (propolice) smoketime 12 hours 46 minutes (average 1 hour 35 minutes) Summary: FAIL(F) O = OK F = Failure(s), extended report at the bottom X = Failure(s) under TEST but not under harness ? = still running or test results not (yet) available Build failures during: - = unknown or N/A c = Configure, m = ...

Smoke [5.11.0] v5.11.0-49-g5b7d14f FAIL(F) openbsd 4.5 (i386/1 cpu)
Automated smoke report for 5.11.0 patch 5b7d14ffe3988c7f70fd9dc76be9c44168d17a62 v5.11.0-49-g5b7d14f p5openbsd: AMD Athlon(tm) Processor ("AuthenticAMD" 686-class, 256KB L2 cache) (909 MHz) (i386/1 cpu) on openbsd - 4.5 using cc version 3.3.5 (propolice) smoketime 12 hours 58 minutes (average 1 hour 37 minutes) Summary: FAIL(F) O = OK F = Failure(s), extended report at the bottom X = Failure(s) under TEST but not under harness ? = still running or test results not (yet) available Build failures during: - = unknown or N/A c = Configure, m = ...

Smoke [5.11.0] v5.11.0-169-g50e225a FAIL(F) netbsd 5.0.1 (i386/1 cpu)
Automated smoke report for 5.11.0 patch 50e225a377de7c314b13cbaf39b6b423215d84a7 v5.11.0-169-g50e225a p5netbsd: Intel 686-class (i386/1 cpu) on netbsd - 5.0.1 using cc version 4.1.3 20080704 prerelease (NetBSD nb2 20081120) smoketime 6 hours 31 minutes (average 48 minutes 59 seconds) Summary: FAIL(F) O = OK F = Failure(s), extended report at the bottom X = Failure(s) under TEST but not under harness ? = still running or test results not (yet) available Build failures during: - = unknown or N/A c = Configure, m = make, M = make (after miniperl), t = m...

Smoke [5.11.0] v5.11.0-219-g26c80ad FAIL(F) netbsd 5.0.1 (i386/1 cpu)
Automated smoke report for 5.11.0 patch 26c80adcc7731c0e4f1238e98e85fa2803538817 v5.11.0-219-g26c80ad p5netbsd: Intel 686-class (i386/1 cpu) on netbsd - 5.0.1 using cc version 4.1.3 20080704 prerelease (NetBSD nb2 20081120) smoketime 6 hours 30 minutes (average 48 minutes 49 seconds) Summary: FAIL(F) O = OK F = Failure(s), extended report at the bottom X = Failure(s) under TEST but not under harness ? = still running or test results not (yet) available Build failures during: - = unknown or N/A c = Configure, m = make, M = make (after miniperl), t = m...

Smoke [5.11.0] v5.11.0-103-g1cce990 FAIL(F) netbsd 5.0.1 (i386/1 cpu)
Automated smoke report for 5.11.0 patch 1cce9906401b8a2db10f2d0061757627ad69f138 v5.11.0-103-g1cce990 p5netbsd: Intel 686-class (i386/1 cpu) on netbsd - 5.0.1 using cc version 4.1.3 20080704 prerelease (NetBSD nb2 20081120) smoketime 8 hours 21 minutes (average 1 hour 2 minutes) Summary: FAIL(F) O = OK F = Failure(s), extended report at the bottom X = Failure(s) under TEST but not under harness ? = still running or test results not (yet) available Build failures during: - = unknown or N/A c = Configure, m = make, M = make (after miniperl), t = make t...

Smoke [5.11.0] v5.11.0-231-g8f3d599 FAIL(F) netbsd 5.0.1 (i386/1 cpu)
Automated smoke report for 5.11.0 patch 8f3d5996a665cf70e12a836b95e184e9ab628251 v5.11.0-231-g8f3d599 p5netbsd: Intel 686-class (i386/1 cpu) on netbsd - 5.0.1 using cc version 4.1.3 20080704 prerelease (NetBSD nb2 20081120) smoketime 6 hours 31 minutes (average 48 minutes 55 seconds) Summary: FAIL(F) O = OK F = Failure(s), extended report at the bottom X = Failure(s) under TEST but not under harness ? = still running or test results not (yet) available Build failures during: - = unknown or N/A c = Configure, m = make, M = make (after miniperl), t = m...

Smoke [5.11.0] v5.11.0-106-g09a3ed3 FAIL(F) netbsd 5.0.1 (i386/1 cpu)
Automated smoke report for 5.11.0 patch 09a3ed31a73051acd8ed0511ea0d927d9660fd22 v5.11.0-106-g09a3ed3 p5netbsd: Intel 686-class (i386/1 cpu) on netbsd - 5.0.1 using cc version 4.1.3 20080704 prerelease (NetBSD nb2 20081120) smoketime 8 hours 30 minutes (average 1 hour 3 minutes) Summary: FAIL(F) O = OK F = Failure(s), extended report at the bottom X = Failure(s) under TEST but not under harness ? = still running or test results not (yet) available Build failures during: - = unknown or N/A c = Configure, m = make, M = make (after miniperl), t = make t...

Smoke [5.11.0] v5.11.0-221-g704e1b1 FAIL(F) netbsd 5.0.1 (i386/1 cpu)
Automated smoke report for 5.11.0 patch 704e1b1ec3309aeb0e2629c93331ffd4c18c8183 v5.11.0-221-g704e1b1 p5netbsd: Intel 686-class (i386/1 cpu) on netbsd - 5.0.1 using cc version 4.1.3 20080704 prerelease (NetBSD nb2 20081120) smoketime 6 hours 34 minutes (average 49 minutes 20 seconds) Summary: FAIL(F) O = OK F = Failure(s), extended report at the bottom X = Failure(s) under TEST but not under harness ? = still running or test results not (yet) available Build failures during: - = unknown or N/A c = Configure, m = make, M = make (after miniperl), t = m...

Smoke [5.11.0] v5.11.0-54-g68cbce5 FAIL(F) netbsd 5.0.1 (i386/1 cpu)
Automated smoke report for 5.11.0 patch 68cbce50efee2c3ae424cfe29c83b65d5b462b69 v5.11.0-54-g68cbce5 p5netbsd: Intel 686-class (i386/1 cpu) on netbsd - 5.0.1 using cc version 4.1.3 20080704 prerelease (NetBSD nb2 20081120) smoketime 8 hours 24 minutes (average 1 hour 3 minutes) Summary: FAIL(F) O = OK F = Failure(s), extended report at the bottom X = Failure(s) under TEST but not under harness ? = still running or test results not (yet) available Build failures during: - = unknown or N/A c = Configure, m = make, M = make (after miniperl), t = make te...

Smoke [5.11.0] v5.11.0-177-g63d690b FAIL(F) netbsd 5.0.1 (i386/1 cpu)
Automated smoke report for 5.11.0 patch 63d690b1f5b7e4a4f5cefe645e21a96651cbe9c2 v5.11.0-177-g63d690b p5netbsd: Intel 686-class (i386/1 cpu) on netbsd - 5.0.1 using cc version 4.1.3 20080704 prerelease (NetBSD nb2 20081120) smoketime 6 hours 35 minutes (average 49 minutes 29 seconds) Summary: FAIL(F) O = OK F = Failure(s), extended report at the bottom X = Failure(s) under TEST but not under harness ? = still running or test results not (yet) available Build failures during: - = unknown or N/A c = Configure, m = make, M = make (after miniperl), t = m...

Smoke [5.11.0] v5.11.0-187-g8dbe7cf FAIL(F) netbsd 5.0.1 (i386/1 cpu)
Automated smoke report for 5.11.0 patch 8dbe7cf704038839ade17963855cf8bfad0c30a3 v5.11.0-187-g8dbe7cf p5netbsd: Intel 686-class (i386/1 cpu) on netbsd - 5.0.1 using cc version 4.1.3 20080704 prerelease (NetBSD nb2 20081120) smoketime 6 hours 35 minutes (average 49 minutes 23 seconds) Summary: FAIL(F) O = OK F = Failure(s), extended report at the bottom X = Failure(s) under TEST but not under harness ? = still running or test results not (yet) available Build failures during: - = unknown or N/A c = Configure, m = make, M = make (after miniperl), t = m...

Smoke [5.11.0] v5.11.0-221-g704e1b1 FAIL(XF) openbsd 4.5 (i386/1 cpu)
Automated smoke report for 5.11.0 patch 704e1b1ec3309aeb0e2629c93331ffd4c18c8183 v5.11.0-221-g704e1b1 p5openbsd: AMD Athlon(tm) Processor ("AuthenticAMD" 686-class, 256KB L2 cache) (909 MHz) (i386/1 cpu) on openbsd - 4.5 using cc version 3.3.5 (propolice) smoketime 12 hours 57 minutes (average 1 hour 37 minutes) Summary: FAIL(XF) O = OK F = Failure(s), extended report at the bottom X = Failure(s) under TEST but not under harness ? = still running or test results not (yet) available Build failures during: - = unknown or N/A c = Configure, m ...

Smoke [5.11.0] v5.11.0-187-g8dbe7cf FAIL(XF) openbsd 4.5 (i386/1 cpu)
Automated smoke report for 5.11.0 patch 8dbe7cf704038839ade17963855cf8bfad0c30a3 v5.11.0-187-g8dbe7cf p5openbsd: AMD Athlon(tm) Processor ("AuthenticAMD" 686-class, 256KB L2 cache) (909 MHz) (i386/1 cpu) on openbsd - 4.5 using cc version 3.3.5 (propolice) smoketime 12 hours 58 minutes (average 1 hour 37 minutes) Summary: FAIL(XF) O = OK F = Failure(s), extended report at the bottom X = Failure(s) under TEST but not under harness ? = still running or test results not (yet) available Build failures during: - = unknown or N/A c = Configure, m ...

Smoke [5.11.4] v5.11.4-56-g6369c73 FAIL(F) netbsd 5.0.1 (i386/1 cpu)
Automated smoke report for 5.11.4 patch 6369c7393bb30f601a91122207e7cc0f0d72983f v5.11.4-56-g6369c73 p5netbsd: Intel 686-class (i386/1 cpu) on netbsd - 5.0.1 using cc version 4.1.3 20080704 prerelease (NetBSD nb2 20081120) smoketime 6 hours 42 minutes (average 50 minutes 16 seconds) Summary: FAIL(F) O = OK F = Failure(s), extended report at the bottom X = Failure(s) under TEST but not under harness ? = still running or test results not (yet) available Build failures during: - = unknown or N/A c = Configure, m = make, M = make (after miniperl), t = ma...

Web resources about - Smoke [5.11.0] v5.11.0-74-g9e7c6af FAIL(F) openbsd 4.5 (i386/1 cpu) - perl.perl5.porters

Resources last updated: 3/10/2016 5:25:35 PM