Smoke [5.11.0] v5.11.0-177-g63d690b FAIL(F) openbsd 4.5 (i386/1 cpu)

Automated smoke report for 5.11.0 patch 63d690b1f5b7e4a4f5cefe645e21a96651cbe9c2 v5.11.0-177-g63d690b
p5openbsd: AMD Athlon(tm) Processor ("AuthenticAMD" 686-class, 256KB L2 cache) (909 MHz) (i386/1 cpu)
    on        openbsd - 4.5
    using     cc version 3.3.5 (propolice)
    smoketime 12 hours 57 minutes (average 1 hour 37 minutes)

Summary: FAIL(F)

O = OK  F = Failure(s), extended report at the bottom
X = Failure(s) under TEST but not under harness
? = still running or test results not (yet) available
Build failures during:       - = unknown or N/A
c = Configure, m = make, M = make (after miniperl), t = make test-prep

v5.11.0-177-g63d690b  Configuration (common) none
----------- ---------------------------------------------------------
F F F F     
F F F F     -Duse64bitint
F F F F     -Duseithreads
F F F F     -Duseithreads -Duse64bitint
| | | +----- PERLIO = perlio -DDEBUGGING
| | +------- PERLIO = stdio  -DDEBUGGING
| +--------- PERLIO = perlio
+----------- PERLIO = stdio


Locally applied patches:
    SMOKE63d690b1f5b7e4a4f5cefe645e21a96651cbe9c2

Failures: (common-args) none
[stdio/perlio] 
[stdio/perlio] -DDEBUGGING
[stdio/perlio] -Duse64bitint
[stdio/perlio] -DDEBUGGING -Duse64bitint
    ../lib/File/Copy.t..........................................FAILED
        Bad plan.  You planned 461 tests but ran 82.
    ../t/re/pat_special_cc.t....................................FAILED
        1, 4, 7

[stdio/perlio] -Duseithreads
[perlio] -DDEBUGGING -Duseithreads
[stdio/perlio] -Duseithreads -Duse64bitint
[stdio/perlio] -DDEBUGGING -Duseithreads -Duse64bitint
    ../lib/File/Copy.t..........................................FAILED
        Bad plan.  You planned 461 tests but ran 82.
    ../t/re/pat_special_cc.t....................................FAILED
        1, 4, 7
    ../t/re/pat_special_cc_thr.t................................FAILED
        1, 4, 7

[stdio] -DDEBUGGING -Duseithreads
    ../lib/File/Copy.t..........................................FAILED
        Bad plan.  You planned 461 tests but ran 82.
    ../t/re/pat_special_cc.t....................................FAILED
        1, 4, 7
    ../t/re/pat_special_cc_thr.t................................FAILED
        1, 4, 7
Inconsistent test results (between TEST and harness):
    ../t/io/errno.t.........................FAILED at test 10

MANIFEST did not declare 'win32/config.gc64'
MANIFEST did not declare 'win32/config_H.gc64'

Compiler messages(gcc):
Configure .../tmp//ccOYGsdY.o(.text+0x3e): In function `main':
/tmp//ccnwFzZw.o(.text+0x5d): In function `main':
/tmp//ccyZIIom.o(.text+0x1c): In function `xxx':
/tmp//ccxAiQOC.o(.text+0xde): In function `main':
sv.o(.text+0x1d8b): In function `Perl_sv_2pv_flags':
libperl.a(DynaLoader.o)(.text+0x242): In function `XS_DynaLoader_dl_load_file':
libperl.a(sv.o)(.text+0x1d8b): In function `Perl_sv_2pv_flags':
<command line>:12:1: warning: "TIME_HIRES_STAT" redefined
<command line>:11:1: warning: this is the location of the previous definition
<command line>:13:1: warning: "TIME_HIRES_STAT" redefined
<command line>:12:1: warning: this is the location of the previous definition
util.o(.text+0x1b3): In function `savestr':
str.o(.text+0x5d): In function `str_2ptr':
.../libperl.a(sv.o)(.text+0x1d8b): In function `Perl_sv_2pv_flags':
Configure .../tmp//cciufUkP.o(.text+0x3e): In function `main':
/home/sts/source/p5-current/UU/try.c:20: warning: sprintf() is often misused, please use snprintf()
/tmp//ccNkMhNo.o(.text+0x5d): In function `main':
/home/sts/source/p5-current/UU/try.c:29: warning: sprintf() is often misused, please use snprintf()
/tmp//ccqDusaS.o(.text+0x1c): In function `xxx':
/home/sts/source/p5-current/UU/try.c:29: warning: vsprintf() is often misused, please use vsnprintf()
/tmp//ccoqmZYX.o(.text+0xde): In function `main':
/home/sts/source/p5-current/UU/try.c:52: warning: sprintf() is often misused, please use snprintf()
sv.o(.text+0xb7e7): In function `Perl_sv_2pv_flags':
/home/sts/source/p5-current/sv.c:2773: warning: sprintf() is often misused, please use snprintf()
libperl.a(DynaLoader.o)(.text+0x556): In function `XS_DynaLoader_dl_load_file':
/home/sts/source/p5-current/ext/DynaLoader/DynaLoader.xs:171: warning: strcat() is almost always misused, please use strlcat()
libperl.a(sv.o)(.text+0xb7e7): In function `Perl_sv_2pv_flags':
<command line>:14:1: warning: "TIME_HIRES_STAT" redefined
<command line>:13:1: warning: this is the location of the previous definition
<command line>:15:1: warning: "TIME_HIRES_STAT" redefined
<command line>:14:1: warning: this is the location of the previous definition
util.o(.text+0x283): In function `savestr':
/home/sts/source/p5-current/x2p/util.c:147: warning: strcpy() is almost always misused, please use strlcpy()
str.o(.text+0x81): In function `str_2ptr':
/home/sts/source/p5-current/x2p/str.c:32: warning: sprintf() is often misused, please use snprintf()
.../libperl.a(sv.o)(.text+0xb7e7): In function `Perl_sv_2pv_flags':
Configure .../tmp//ccHHECHI.o(.text+0x3e): In function `main':
/tmp//ccBnsRhe.o(.text+0x5d): In function `main':
/tmp//ccZvXKdW.o(.text+0x1c): In function `xxx':
/tmp//ccEzzrjO.o(.text+0xde): In function `main':
sv.o(.text+0x224f): In function `Perl_sv_2pv_flags':
libperl.a(sv.o)(.text+0x224f): In function `Perl_sv_2pv_flags':
.../libperl.a(sv.o)(.text+0x224f): In function `Perl_sv_2pv_flags':
Configure .../tmp//ccQUurza.o(.text+0x3e): In function `main':
/tmp//ccYYLQiq.o(.text+0x5d): In function `main':
/tmp//cceuKUHn.o(.text+0x1c): In function `xxx':
/tmp//ccTQopPF.o(.text+0xde): In function `main':
sv.o(.text+0xac0a): In function `Perl_sv_2pv_flags':
libperl.a(DynaLoader.o)(.text+0x55a): In function `XS_DynaLoader_dl_load_file':
libperl.a(sv.o)(.text+0xac0a): In function `Perl_sv_2pv_flags':
.../libperl.a(sv.o)(.text+0xac0a): In function `Perl_sv_2pv_flags':
Configure .../tmp//ccEFUuSF.o(.text+0x3e): In function `main':
/tmp//ccxCIhqg.o(.text+0x5d): In function `main':
/tmp//cciCfQvE.o(.text+0x1c): In function `xxx':
/tmp//ccibTOTh.o(.text+0xde): In function `main':
sv.o(.text+0x1ee7): In function `Perl_sv_2pv_flags':
libperl.a(DynaLoader.o)(.text+0x4aa): In function `XS_DynaLoader_dl_load_file':
libperl.a(sv.o)(.text+0x1ee7): In function `Perl_sv_2pv_flags':
.../libperl.a(sv.o)(.text+0x1ee7): In function `Perl_sv_2pv_flags':
Configure .../tmp//cczjVFci.o(.text+0x3e): In function `main':
/tmp//ccPoZGBa.o(.text+0x5d): In function `main':
/tmp//ccMKIbtA.o(.text+0x1c): In function `xxx':
/tmp//ccwcAYVt.o(.text+0xde): In function `main':
sv.o(.text+0xba1f): In function `Perl_sv_2pv_flags':
libperl.a(DynaLoader.o)(.text+0x8de): In function `XS_DynaLoader_dl_load_file':
libperl.a(sv.o)(.text+0xba1f): In function `Perl_sv_2pv_flags':
<command line>:16:1: warning: "TIME_HIRES_STAT" redefined
<command line>:15:1: warning: this is the location of the previous definition
.../libperl.a(sv.o)(.text+0xba1f): In function `Perl_sv_2pv_flags':
Configure .../tmp//ccAeQGGK.o(.text+0x3e): In function `main':
/tmp//ccZhmXEc.o(.text+0x5d): In function `main':
/tmp//cczdevlP.o(.text+0x1c): In function `xxx':
/tmp//ccxSWByx.o(.text+0xde): In function `main':
sv.o(.text+0x239b): In function `Perl_sv_2pv_flags':
libperl.a(sv.o)(.text+0x239b): In function `Perl_sv_2pv_flags':
.../libperl.a(sv.o)(.text+0x239b): In function `Perl_sv_2pv_flags':
Configure .../tmp//cchbWOzB.o(.text+0x3e): In function `main':
/tmp//ccUEdFWY.o(.text+0x5d): In function `main':
/tmp//cchxjasg.o(.text+0x1c): In function `xxx':
/tmp//ccgpyaqO.o(.text+0xde): In function `main':
sv.o(.text+0xaea2): In function `Perl_sv_2pv_flags':
libperl.a(sv.o)(.text+0xaea2): In function `Perl_sv_2pv_flags':
.../libperl.a(sv.o)(.text+0xaea2): In function `Perl_sv_2pv_flags':

-- 
Report by Test::Smoke v1.40 build 1242 running on perl 5.10.0
(Reporter v0.035 / Smoker v0.044)
0
stsc
10/15/2009 11:14:50 AM
perl.perl5.porters 48287 articles. 1 followers. Follow

0 Replies
520 Views

Similar Articles

[PageSpeed] 7

Reply: