Smoke [5.11.0] v5.11.0-12-gb9fb583 FAIL(F) openbsd 4.5 (i386/1 cpu)

Automated smoke report for 5.11.0 patch b9fb583619490a0ded37e01402169cea64f6c91e v5.11.0-12-gb9fb583
p5openbsd: AMD Athlon(tm) Processor ("AuthenticAMD" 686-class, 256KB L2 cache) (909 MHz) (i386/1 cpu)
    on        openbsd - 4.5
    using     cc version 3.3.5 (propolice)
    smoketime 12 hours 45 minutes (average 1 hour 35 minutes)

Summary: FAIL(F)

O = OK  F = Failure(s), extended report at the bottom
X = Failure(s) under TEST but not under harness
? = still running or test results not (yet) available
Build failures during:       - = unknown or N/A
c = Configure, m = make, M = make (after miniperl), t = make test-prep

v5.11.0-12-gb9fb583  Configuration (common) none
----------- ---------------------------------------------------------
F F F F     
F F F F     -Duse64bitint
F F F F     -Duseithreads
F F F F     -Duseithreads -Duse64bitint
| | | +----- PERLIO = perlio -DDEBUGGING
| | +------- PERLIO = stdio  -DDEBUGGING
| +--------- PERLIO = perlio
+----------- PERLIO = stdio


Locally applied patches:
    SMOKEb9fb583619490a0ded37e01402169cea64f6c91e

Failures: (common-args) none
[stdio/perlio] 
[stdio/perlio] -DDEBUGGING
[stdio/perlio] -Duse64bitint
[stdio/perlio] -DDEBUGGING -Duse64bitint
[stdio/perlio] -Duseithreads
[stdio] -DDEBUGGING -Duseithreads
[stdio/perlio] -Duseithreads -Duse64bitint
[stdio/perlio] -DDEBUGGING -Duseithreads -Duse64bitint
    ../lib/File/Copy.t..........................................FAILED
        Bad plan.  You planned 461 tests but ran 82.

[perlio] -DDEBUGGING -Duseithreads
    ../lib/File/Copy.t..........................................FAILED
        Bad plan.  You planned 461 tests but ran 82.
Inconsistent test results (between TEST and harness):
    ../t/io/errno.t.........................FAILED at test 16

Compiler messages(gcc):
Configure .../tmp//ccUGYQjH.o(.text+0x3e): In function `main':
/tmp//ccLMZbaF.o(.text+0x5d): In function `main':
/tmp//ccmhznWh.o(.text+0x1c): In function `xxx':
/tmp//ccXnThwN.o(.text+0xde): In function `main':
sv.o(.text+0x1d8b): In function `Perl_sv_2pv_flags':
libperl.a(DynaLoader.o)(.text+0x242): In function `XS_DynaLoader_dl_load_file':
libperl.a(sv.o)(.text+0x1d8b): In function `Perl_sv_2pv_flags':
<command line>:12:1: warning: "TIME_HIRES_STAT" redefined
<command line>:11:1: warning: this is the location of the previous definition
<command line>:13:1: warning: "TIME_HIRES_STAT" redefined
<command line>:12:1: warning: this is the location of the previous definition
util.o(.text+0x1b3): In function `savestr':
str.o(.text+0x5d): In function `str_2ptr':
.../libperl.a(sv.o)(.text+0x1d8b): In function `Perl_sv_2pv_flags':
Configure .../tmp//ccDtnsLm.o(.text+0x3e): In function `main':
/home/sts/source/p5-current/UU/try.c:20: warning: sprintf() is often misused, please use snprintf()
/tmp//ccIMdMIR.o(.text+0x5d): In function `main':
/home/sts/source/p5-current/UU/try.c:29: warning: sprintf() is often misused, please use snprintf()
/tmp//ccPjKmYV.o(.text+0x1c): In function `xxx':
/home/sts/source/p5-current/UU/try.c:29: warning: vsprintf() is often misused, please use vsnprintf()
/tmp//ccaSEaWV.o(.text+0xde): In function `main':
/home/sts/source/p5-current/UU/try.c:52: warning: sprintf() is often misused, please use snprintf()
sv.o(.text+0xb7ff): In function `Perl_sv_2pv_flags':
/home/sts/source/p5-current/sv.c:2774: warning: sprintf() is often misused, please use snprintf()
libperl.a(DynaLoader.o)(.text+0x556): In function `XS_DynaLoader_dl_load_file':
/home/sts/source/p5-current/ext/DynaLoader/DynaLoader.xs:171: warning: strcat() is almost always misused, please use strlcat()
libperl.a(sv.o)(.text+0xb7ff): In function `Perl_sv_2pv_flags':
<command line>:14:1: warning: "TIME_HIRES_STAT" redefined
<command line>:13:1: warning: this is the location of the previous definition
<command line>:15:1: warning: "TIME_HIRES_STAT" redefined
<command line>:14:1: warning: this is the location of the previous definition
util.o(.text+0x283): In function `savestr':
/home/sts/source/p5-current/x2p/util.c:147: warning: strcpy() is almost always misused, please use strlcpy()
str.o(.text+0x81): In function `str_2ptr':
/home/sts/source/p5-current/x2p/str.c:32: warning: sprintf() is often misused, please use snprintf()
.../libperl.a(sv.o)(.text+0xb7ff): In function `Perl_sv_2pv_flags':
Configure .../tmp//ccGocemZ.o(.text+0x3e): In function `main':
/tmp//ccPyCxxR.o(.text+0x5d): In function `main':
/tmp//ccbZyFjU.o(.text+0x1c): In function `xxx':
/tmp//ccImPXnS.o(.text+0xde): In function `main':
sv.o(.text+0x224f): In function `Perl_sv_2pv_flags':
libperl.a(sv.o)(.text+0x224f): In function `Perl_sv_2pv_flags':
.../libperl.a(sv.o)(.text+0x224f): In function `Perl_sv_2pv_flags':
Configure .../tmp//ccapQdpv.o(.text+0x3e): In function `main':
/tmp//ccuBpzaQ.o(.text+0x5d): In function `main':
/tmp//ccUSNUeI.o(.text+0x1c): In function `xxx':
/tmp//ccfjhurQ.o(.text+0xde): In function `main':
sv.o(.text+0xac26): In function `Perl_sv_2pv_flags':
libperl.a(DynaLoader.o)(.text+0x55a): In function `XS_DynaLoader_dl_load_file':
libperl.a(sv.o)(.text+0xac26): In function `Perl_sv_2pv_flags':
.../libperl.a(sv.o)(.text+0xac26): In function `Perl_sv_2pv_flags':
Configure .../tmp//cchhqapl.o(.text+0x3e): In function `main':
/tmp//ccXlPZiS.o(.text+0x5d): In function `main':
/tmp//cciOmbtv.o(.text+0x1c): In function `xxx':
/tmp//ccxBvxWe.o(.text+0xde): In function `main':
sv.o(.text+0x1ee7): In function `Perl_sv_2pv_flags':
libperl.a(DynaLoader.o)(.text+0x4aa): In function `XS_DynaLoader_dl_load_file':
libperl.a(sv.o)(.text+0x1ee7): In function `Perl_sv_2pv_flags':
.../libperl.a(sv.o)(.text+0x1ee7): In function `Perl_sv_2pv_flags':
Configure .../tmp//ccrKcOEt.o(.text+0x3e): In function `main':
/tmp//ccRBVuCd.o(.text+0x5d): In function `main':
/tmp//cclYxHWp.o(.text+0x1c): In function `xxx':
/tmp//ccEJcFPR.o(.text+0xde): In function `main':
sv.o(.text+0xba3b): In function `Perl_sv_2pv_flags':
libperl.a(DynaLoader.o)(.text+0x8de): In function `XS_DynaLoader_dl_load_file':
libperl.a(sv.o)(.text+0xba3b): In function `Perl_sv_2pv_flags':
<command line>:16:1: warning: "TIME_HIRES_STAT" redefined
<command line>:15:1: warning: this is the location of the previous definition
.../libperl.a(sv.o)(.text+0xba3b): In function `Perl_sv_2pv_flags':
Configure .../tmp//ccCyMZsx.o(.text+0x3e): In function `main':
/tmp//cctKdcGF.o(.text+0x5d): In function `main':
/tmp//ccCsueEL.o(.text+0x1c): In function `xxx':
/tmp//ccALGIPR.o(.text+0xde): In function `main':
sv.o(.text+0x239b): In function `Perl_sv_2pv_flags':
libperl.a(sv.o)(.text+0x239b): In function `Perl_sv_2pv_flags':
.../libperl.a(sv.o)(.text+0x239b): In function `Perl_sv_2pv_flags':
Configure .../tmp//ccFLxuvQ.o(.text+0x3e): In function `main':
/tmp//ccgECSfu.o(.text+0x5d): In function `main':
/tmp//ccebdZlm.o(.text+0x1c): In function `xxx':
/tmp//ccWStlob.o(.text+0xde): In function `main':
sv.o(.text+0xaebe): In function `Perl_sv_2pv_flags':
libperl.a(sv.o)(.text+0xaebe): In function `Perl_sv_2pv_flags':
.../libperl.a(sv.o)(.text+0xaebe): In function `Perl_sv_2pv_flags':

-- 
Report by Test::Smoke v1.40 build 1242 running on perl 5.10.0
(Reporter v0.035 / Smoker v0.044)
0
stsc
10/4/2009 11:01:53 AM
perl.perl5.porters 48287 articles. 1 followers. Follow

0 Replies
783 Views

Similar Articles

[PageSpeed] 52
Get it on Google Play
Get it on Apple App Store

Reply:

Similar Artilces:

Smoke [5.11.0] v5.11.0-1-g9911515 FAIL(F) openbsd 4.5 (i386/1 cpu)
Automated smoke report for 5.11.0 patch 99115150e3b424e330d9007fc4005e056210f907 v5.11.0-1-g9911515 p5openbsd: AMD Athlon(tm) Processor ("AuthenticAMD" 686-class, 256KB L2 cache) (909 MHz) (i386/1 cpu) on openbsd - 4.5 using cc version 3.3.5 (propolice) smoketime 12 hours 44 minutes (average 1 hour 35 minutes) Summary: FAIL(F) O = OK F = Failure(s), extended report at the bottom X = Failure(s) under TEST but not under harness ? = still running or test results not (yet) available Build failures during: - = unknown or N/A c = Configure, m = m...

Smoke [5.11.0] v5.11.0-17-g28e464f FAIL(F) openbsd 4.5 (i386/1 cpu)
Automated smoke report for 5.11.0 patch 28e464fba839d02f376952199261fc8b7d58a0d8 v5.11.0-17-g28e464f p5openbsd: AMD Athlon(tm) Processor ("AuthenticAMD" 686-class, 256KB L2 cache) (909 MHz) (i386/1 cpu) on openbsd - 4.5 using cc version 3.3.5 (propolice) smoketime 12 hours 46 minutes (average 1 hour 35 minutes) Summary: FAIL(F) O = OK F = Failure(s), extended report at the bottom X = Failure(s) under TEST but not under harness ? = still running or test results not (yet) available Build failures during: - = unknown or N/A c = Configure, m = ...

Smoke [5.11.0] v5.11.0-169-g50e225a FAIL(F) openbsd 4.5 (i386/1 cpu)
Automated smoke report for 5.11.0 patch 50e225a377de7c314b13cbaf39b6b423215d84a7 v5.11.0-169-g50e225a p5openbsd: AMD Athlon(tm) Processor ("AuthenticAMD" 686-class, 256KB L2 cache) (909 MHz) (i386/1 cpu) on openbsd - 4.5 using cc version 3.3.5 (propolice) smoketime 12 hours 55 minutes (average 1 hour 36 minutes) Summary: FAIL(F) O = OK F = Failure(s), extended report at the bottom X = Failure(s) under TEST but not under harness ? = still running or test results not (yet) available Build failures during: - = unknown or N/A c = Configure, m =...

Smoke [5.11.0] v5.11.0-74-g9e7c6af FAIL(F) openbsd 4.5 (i386/1 cpu)
Automated smoke report for 5.11.0 patch 9e7c6af37d3320462cbceb74b487ade8224b9191 v5.11.0-74-g9e7c6af p5openbsd: AMD Athlon(tm) Processor ("AuthenticAMD" 686-class, 256KB L2 cache) (909 MHz) (i386/1 cpu) on openbsd - 4.5 using cc version 3.3.5 (propolice) smoketime 12 hours 57 minutes (average 1 hour 37 minutes) Summary: FAIL(F) O = OK F = Failure(s), extended report at the bottom X = Failure(s) under TEST but not under harness ? = still running or test results not (yet) available Build failures during: - = unknown or N/A c = Configure, m = ...

Smoke [5.11.0] v5.11.0-177-g63d690b FAIL(F) openbsd 4.5 (i386/1 cpu)
Automated smoke report for 5.11.0 patch 63d690b1f5b7e4a4f5cefe645e21a96651cbe9c2 v5.11.0-177-g63d690b p5openbsd: AMD Athlon(tm) Processor ("AuthenticAMD" 686-class, 256KB L2 cache) (909 MHz) (i386/1 cpu) on openbsd - 4.5 using cc version 3.3.5 (propolice) smoketime 12 hours 57 minutes (average 1 hour 37 minutes) Summary: FAIL(F) O = OK F = Failure(s), extended report at the bottom X = Failure(s) under TEST but not under harness ? = still running or test results not (yet) available Build failures during: - = unknown or N/A c = Configure, m =...

Smoke [5.11.0] v5.11.0-219-g26c80ad FAIL(F) openbsd 4.5 (i386/1 cpu)
Automated smoke report for 5.11.0 patch 26c80adcc7731c0e4f1238e98e85fa2803538817 v5.11.0-219-g26c80ad p5openbsd: AMD Athlon(tm) Processor ("AuthenticAMD" 686-class, 256KB L2 cache) (909 MHz) (i386/1 cpu) on openbsd - 4.5 using cc version 3.3.5 (propolice) smoketime 12 hours 58 minutes (average 1 hour 37 minutes) Summary: FAIL(F) O = OK F = Failure(s), extended report at the bottom X = Failure(s) under TEST but not under harness ? = still running or test results not (yet) available Build failures during: - = unknown or N/A c = Configure, m =...

Smoke [5.11.0] v5.11.0-103-g1cce990 FAIL(F) openbsd 4.5 (i386/1 cpu)
Automated smoke report for 5.11.0 patch 1cce9906401b8a2db10f2d0061757627ad69f138 v5.11.0-103-g1cce990 p5openbsd: AMD Athlon(tm) Processor ("AuthenticAMD" 686-class, 256KB L2 cache) (909 MHz) (i386/1 cpu) on openbsd - 4.5 using cc version 3.3.5 (propolice) smoketime 12 hours 59 minutes (average 1 hour 37 minutes) Summary: FAIL(F) O = OK F = Failure(s), extended report at the bottom X = Failure(s) under TEST but not under harness ? = still running or test results not (yet) available Build failures during: - = unknown or N/A c = Configure, m =...

Smoke [5.11.0] v5.11.0-106-g09a3ed3 FAIL(F) openbsd 4.5 (i386/1 cpu)
Automated smoke report for 5.11.0 patch 09a3ed31a73051acd8ed0511ea0d927d9660fd22 v5.11.0-106-g09a3ed3 p5openbsd: AMD Athlon(tm) Processor ("AuthenticAMD" 686-class, 256KB L2 cache) (909 MHz) (i386/1 cpu) on openbsd - 4.5 using cc version 3.3.5 (propolice) smoketime 12 hours 58 minutes (average 1 hour 37 minutes) Summary: FAIL(F) O = OK F = Failure(s), extended report at the bottom X = Failure(s) under TEST but not under harness ? = still running or test results not (yet) available Build failures during: - = unknown or N/A c = Configure, m =...

Smoke [5.11.0] v5.11.0-49-g5b7d14f FAIL(F) openbsd 4.5 (i386/1 cpu)
Automated smoke report for 5.11.0 patch 5b7d14ffe3988c7f70fd9dc76be9c44168d17a62 v5.11.0-49-g5b7d14f p5openbsd: AMD Athlon(tm) Processor ("AuthenticAMD" 686-class, 256KB L2 cache) (909 MHz) (i386/1 cpu) on openbsd - 4.5 using cc version 3.3.5 (propolice) smoketime 12 hours 58 minutes (average 1 hour 37 minutes) Summary: FAIL(F) O = OK F = Failure(s), extended report at the bottom X = Failure(s) under TEST but not under harness ? = still running or test results not (yet) available Build failures during: - = unknown or N/A c = Configure, m = ...

Smoke [5.11.0] v5.11.0-54-g68cbce5 FAIL(F) openbsd 4.5 (i386/1 cpu)
Automated smoke report for 5.11.0 patch 68cbce50efee2c3ae424cfe29c83b65d5b462b69 v5.11.0-54-g68cbce5 p5openbsd: AMD Athlon(tm) Processor ("AuthenticAMD" 686-class, 256KB L2 cache) (909 MHz) (i386/1 cpu) on openbsd - 4.5 using cc version 3.3.5 (propolice) smoketime 12 hours 58 minutes (average 1 hour 37 minutes) Summary: FAIL(F) O = OK F = Failure(s), extended report at the bottom X = Failure(s) under TEST but not under harness ? = still running or test results not (yet) available Build failures during: - = unknown or N/A c = Configure, m = ...

Smoke [5.11.0] v5.11.0-31-g2d5f1d0 FAIL(F) openbsd 4.5 (i386/1 cpu)
Automated smoke report for 5.11.0 patch 2d5f1d01166a325b29ccc86102d26e68def13786 v5.11.0-31-g2d5f1d0 p5openbsd: AMD Athlon(tm) Processor ("AuthenticAMD" 686-class, 256KB L2 cache) (909 MHz) (i386/1 cpu) on openbsd - 4.5 using cc version 3.3.5 (propolice) smoketime 12 hours 43 minutes (average 1 hour 35 minutes) Summary: FAIL(F) O = OK F = Failure(s), extended report at the bottom X = Failure(s) under TEST but not under harness ? = still running or test results not (yet) available Build failures during: - = unknown or N/A c = Configure, m = ...

Smoke [5.11.0] v5.11.0-231-g8f3d599 FAIL(F) netbsd 5.0.1 (i386/1 cpu)
Automated smoke report for 5.11.0 patch 8f3d5996a665cf70e12a836b95e184e9ab628251 v5.11.0-231-g8f3d599 p5netbsd: Intel 686-class (i386/1 cpu) on netbsd - 5.0.1 using cc version 4.1.3 20080704 prerelease (NetBSD nb2 20081120) smoketime 6 hours 31 minutes (average 48 minutes 55 seconds) Summary: FAIL(F) O = OK F = Failure(s), extended report at the bottom X = Failure(s) under TEST but not under harness ? = still running or test results not (yet) available Build failures during: - = unknown or N/A c = Configure, m = make, M = make (after miniperl), t = m...

Smoke [5.11.0] v5.11.0-54-g68cbce5 FAIL(F) netbsd 5.0.1 (i386/1 cpu)
Automated smoke report for 5.11.0 patch 68cbce50efee2c3ae424cfe29c83b65d5b462b69 v5.11.0-54-g68cbce5 p5netbsd: Intel 686-class (i386/1 cpu) on netbsd - 5.0.1 using cc version 4.1.3 20080704 prerelease (NetBSD nb2 20081120) smoketime 8 hours 24 minutes (average 1 hour 3 minutes) Summary: FAIL(F) O = OK F = Failure(s), extended report at the bottom X = Failure(s) under TEST but not under harness ? = still running or test results not (yet) available Build failures during: - = unknown or N/A c = Configure, m = make, M = make (after miniperl), t = make te...

Smoke [5.11.0] v5.11.0-74-g9e7c6af FAIL(F) netbsd 5.0.1 (i386/1 cpu)
Automated smoke report for 5.11.0 patch 9e7c6af37d3320462cbceb74b487ade8224b9191 v5.11.0-74-g9e7c6af p5netbsd: Intel 686-class (i386/1 cpu) on netbsd - 5.0.1 using cc version 4.1.3 20080704 prerelease (NetBSD nb2 20081120) smoketime 8 hours 32 minutes (average 1 hour 4 minutes) Summary: FAIL(F) O = OK F = Failure(s), extended report at the bottom X = Failure(s) under TEST but not under harness ? = still running or test results not (yet) available Build failures during: - = unknown or N/A c = Configure, m = make, M = make (after miniperl), t = make te...

Web resources about - Smoke [5.11.0] v5.11.0-12-gb9fb583 FAIL(F) openbsd 4.5 (i386/1 cpu) - perl.perl5.porters

Updated Windows 10 this month? Check your privacy settings
Two weeks ago, Microsoft rolled out its so far biggest update to Windows 10, bringing in a couple of new customization features, improvements ...

Paris attacks mastermind returned to scene
Telegraph.co.uk Paris attacks mastermind returned to scene - 24 November as it happened Telegraph.co.uk ... • Live: Brussels starts to reopen ...

Apple’s Acquisition Of FaceShift Has Been Confirmed
A couple of months ago it was reported that Apple had apparently acquired facial motion capture technology firm FaceShift. The Cupertino company ...

Russian pilot rescued by Syrian commando unit
DAMASCUS, Syria (AP) — A Russian military pilot whose plane was shot down by Turkey and crashed in Syria arrived on Wednesday at an air base ...

Jeff Bezos is proud of his rocket, Elon Musk not impressed
Amazon Founder and CEO Jeff Bezos saw his private spaceflight company, Blue Origin, hit a major milestone today by launching and landing its ...

Cheap Gas Fueling Expanded Thanksgiving Travel Day
Thanksgiving travel begins with gas prices low, terrorism fears high

Amazon May Not Have Requested That NYC Yank Nazi-Themed Ads
Did Amazon Studios really request that its controversial New York City subway ads for the ambitious drama “The Man In The High Castle” be removed? ...

Yet Another Dell Root Certificate Found Out
It looks like things are not all that rosy over at Dell, as yet another Dell root certificate has been discovered, which is in addition to what ...

Security tight after Tunisia bomb blast kills at least 13
At least 13 people were killed in Tuesday's apparent suicide bombing of a Tunisian presidential guard bus in central Tunis, prompting the government ...

Syrian refugees in US fear for those left behind
Sitting on a donated couch in her modest Chicago apartment, Safa Mshymish knows she is among the lucky ones: a Syrian refugee welcomed into the ...

Resources last updated: 11/25/2015 11:20:12 AM