Smoke [5.11.0] v5.11.0-106-g09a3ed3 FAIL(F) openbsd 4.5 (i386/1 cpu)

Automated smoke report for 5.11.0 patch 09a3ed31a73051acd8ed0511ea0d927d9660fd22 v5.11.0-106-g09a3ed3
p5openbsd: AMD Athlon(tm) Processor ("AuthenticAMD" 686-class, 256KB L2 cache) (909 MHz) (i386/1 cpu)
    on        openbsd - 4.5
    using     cc version 3.3.5 (propolice)
    smoketime 12 hours 58 minutes (average 1 hour 37 minutes)

Summary: FAIL(F)

O = OK  F = Failure(s), extended report at the bottom
X = Failure(s) under TEST but not under harness
? = still running or test results not (yet) available
Build failures during:       - = unknown or N/A
c = Configure, m = make, M = make (after miniperl), t = make test-prep

v5.11.0-106-g09a3ed3  Configuration (common) none
----------- ---------------------------------------------------------
F F F F     
F F F F     -Duse64bitint
F F F F     -Duseithreads
F F F F     -Duseithreads -Duse64bitint
| | | +----- PERLIO = perlio -DDEBUGGING
| | +------- PERLIO = stdio  -DDEBUGGING
| +--------- PERLIO = perlio
+----------- PERLIO = stdio


Locally applied patches:
    SMOKE09a3ed31a73051acd8ed0511ea0d927d9660fd22

Failures: (common-args) none
[stdio/perlio] 
[stdio/perlio] -DDEBUGGING
[stdio/perlio] -Duse64bitint
[stdio/perlio] -DDEBUGGING -Duse64bitint
    ../lib/File/Copy.t..........................................FAILED
        Bad plan.  You planned 461 tests but ran 82.
    ../t/re/pat_special_cc.t....................................FAILED
        1, 4, 7

[stdio/perlio] -Duseithreads
[stdio] -DDEBUGGING -Duseithreads
[stdio] -Duseithreads -Duse64bitint
[stdio/perlio] -DDEBUGGING -Duseithreads -Duse64bitint
    ../lib/File/Copy.t..........................................FAILED
        Bad plan.  You planned 461 tests but ran 82.
    ../t/re/pat_special_cc.t....................................FAILED
        1, 4, 7
    ../t/re/pat_special_cc_thr.t................................FAILED
        1, 4, 7

[perlio] -DDEBUGGING -Duseithreads
    ../lib/File/Copy.t..........................................FAILED
        Bad plan.  You planned 461 tests but ran 82.
    ../t/io/errno.t.............................................FAILED
        10
    ../t/re/pat_special_cc.t....................................FAILED
        1, 4, 7
    ../t/re/pat_special_cc_thr.t................................FAILED
        1, 4, 7

[perlio] -Duseithreads -Duse64bitint
    ../lib/File/Copy.t..........................................FAILED
        Bad plan.  You planned 461 tests but ran 82.
    ../t/re/pat_special_cc.t....................................FAILED
        1, 4, 7
    ../t/re/pat_special_cc_thr.t................................FAILED
        1, 4, 7
Inconsistent test results (between TEST and harness):
    ../t/io/errno.t.........................FAILED at test 13

Compiler messages(gcc):
Configure .../tmp//cceckFSB.o(.text+0x3e): In function `main':
/tmp//ccXxrjea.o(.text+0x5d): In function `main':
/tmp//ccRodhtG.o(.text+0x1c): In function `xxx':
/tmp//ccaanhcA.o(.text+0xde): In function `main':
sv.o(.text+0x1d8b): In function `Perl_sv_2pv_flags':
libperl.a(DynaLoader.o)(.text+0x242): In function `XS_DynaLoader_dl_load_file':
libperl.a(sv.o)(.text+0x1d8b): In function `Perl_sv_2pv_flags':
<command line>:12:1: warning: "TIME_HIRES_STAT" redefined
<command line>:11:1: warning: this is the location of the previous definition
<command line>:13:1: warning: "TIME_HIRES_STAT" redefined
<command line>:12:1: warning: this is the location of the previous definition
util.o(.text+0x1b3): In function `savestr':
str.o(.text+0x5d): In function `str_2ptr':
.../libperl.a(sv.o)(.text+0x1d8b): In function `Perl_sv_2pv_flags':
Configure .../tmp//ccqxpOpK.o(.text+0x3e): In function `main':
/home/sts/source/p5-current/UU/try.c:20: warning: sprintf() is often misused, please use snprintf()
/tmp//ccOOZbIN.o(.text+0x5d): In function `main':
/home/sts/source/p5-current/UU/try.c:29: warning: sprintf() is often misused, please use snprintf()
/tmp//ccNnFjHq.o(.text+0x1c): In function `xxx':
/home/sts/source/p5-current/UU/try.c:29: warning: vsprintf() is often misused, please use vsnprintf()
/tmp//cckFCphr.o(.text+0xde): In function `main':
/home/sts/source/p5-current/UU/try.c:52: warning: sprintf() is often misused, please use snprintf()
sv.o(.text+0xb7ff): In function `Perl_sv_2pv_flags':
/home/sts/source/p5-current/sv.c:2774: warning: sprintf() is often misused, please use snprintf()
libperl.a(DynaLoader.o)(.text+0x556): In function `XS_DynaLoader_dl_load_file':
/home/sts/source/p5-current/ext/DynaLoader/DynaLoader.xs:171: warning: strcat() is almost always misused, please use strlcat()
libperl.a(sv.o)(.text+0xb7ff): In function `Perl_sv_2pv_flags':
<command line>:14:1: warning: "TIME_HIRES_STAT" redefined
<command line>:13:1: warning: this is the location of the previous definition
<command line>:15:1: warning: "TIME_HIRES_STAT" redefined
<command line>:14:1: warning: this is the location of the previous definition
util.o(.text+0x283): In function `savestr':
/home/sts/source/p5-current/x2p/util.c:147: warning: strcpy() is almost always misused, please use strlcpy()
str.o(.text+0x81): In function `str_2ptr':
/home/sts/source/p5-current/x2p/str.c:32: warning: sprintf() is often misused, please use snprintf()
.../libperl.a(sv.o)(.text+0xb7ff): In function `Perl_sv_2pv_flags':
Configure .../tmp//ccVHGRhb.o(.text+0x3e): In function `main':
/tmp//ccqazNmD.o(.text+0x5d): In function `main':
/tmp//ccwxVsoB.o(.text+0x1c): In function `xxx':
/tmp//ccYYjVtF.o(.text+0xde): In function `main':
sv.o(.text+0x224f): In function `Perl_sv_2pv_flags':
libperl.a(sv.o)(.text+0x224f): In function `Perl_sv_2pv_flags':
.../libperl.a(sv.o)(.text+0x224f): In function `Perl_sv_2pv_flags':
Configure .../tmp//ccZrKQjO.o(.text+0x3e): In function `main':
/tmp//ccnSOyUW.o(.text+0x5d): In function `main':
/tmp//cckkmsck.o(.text+0x1c): In function `xxx':
/tmp//ccEUWJiV.o(.text+0xde): In function `main':
sv.o(.text+0xac26): In function `Perl_sv_2pv_flags':
libperl.a(DynaLoader.o)(.text+0x55a): In function `XS_DynaLoader_dl_load_file':
libperl.a(sv.o)(.text+0xac26): In function `Perl_sv_2pv_flags':
.../libperl.a(sv.o)(.text+0xac26): In function `Perl_sv_2pv_flags':
Configure .../tmp//ccwmQoLM.o(.text+0x3e): In function `main':
/tmp//ccjCRNsI.o(.text+0x5d): In function `main':
/tmp//ccnHcgXE.o(.text+0x1c): In function `xxx':
/tmp//ccIWeYNL.o(.text+0xde): In function `main':
sv.o(.text+0x1ee7): In function `Perl_sv_2pv_flags':
libperl.a(DynaLoader.o)(.text+0x4aa): In function `XS_DynaLoader_dl_load_file':
libperl.a(sv.o)(.text+0x1ee7): In function `Perl_sv_2pv_flags':
.../libperl.a(sv.o)(.text+0x1ee7): In function `Perl_sv_2pv_flags':
Configure .../tmp//ccNvivOj.o(.text+0x3e): In function `main':
/tmp//ccfwrdzT.o(.text+0x5d): In function `main':
/tmp//ccnigtpK.o(.text+0x1c): In function `xxx':
/tmp//ccnDuJxx.o(.text+0xde): In function `main':
sv.o(.text+0xba3b): In function `Perl_sv_2pv_flags':
libperl.a(DynaLoader.o)(.text+0x8de): In function `XS_DynaLoader_dl_load_file':
libperl.a(sv.o)(.text+0xba3b): In function `Perl_sv_2pv_flags':
<command line>:16:1: warning: "TIME_HIRES_STAT" redefined
<command line>:15:1: warning: this is the location of the previous definition
.../libperl.a(sv.o)(.text+0xba3b): In function `Perl_sv_2pv_flags':
Configure .../tmp//ccEzgRUd.o(.text+0x3e): In function `main':
/tmp//ccgAHwWw.o(.text+0x5d): In function `main':
/tmp//ccfahfsr.o(.text+0x1c): In function `xxx':
/tmp//ccLGGPZo.o(.text+0xde): In function `main':
sv.o(.text+0x239b): In function `Perl_sv_2pv_flags':
libperl.a(sv.o)(.text+0x239b): In function `Perl_sv_2pv_flags':
.../libperl.a(sv.o)(.text+0x239b): In function `Perl_sv_2pv_flags':
Configure .../tmp//ccJRkQkn.o(.text+0x3e): In function `main':
/tmp//ccZNgXVu.o(.text+0x5d): In function `main':
/tmp//ccHjozxw.o(.text+0x1c): In function `xxx':
/tmp//cczOuIhL.o(.text+0xde): In function `main':
sv.o(.text+0xaebe): In function `Perl_sv_2pv_flags':
libperl.a(sv.o)(.text+0xaebe): In function `Perl_sv_2pv_flags':
.../libperl.a(sv.o)(.text+0xaebe): In function `Perl_sv_2pv_flags':

-- 
Report by Test::Smoke v1.40 build 1242 running on perl 5.10.0
(Reporter v0.035 / Smoker v0.044)
0
stsc
10/11/2009 11:15:45 AM
perl.perl5.porters 48287 articles. 1 followers. Follow

0 Replies
668 Views

Similar Articles

[PageSpeed] 42
Get it on Google Play
Get it on Apple App Store

Reply:

Similar Artilces:

Smoke [5.11.0] v5.11.0-106-g09a3ed3 FAIL(F) netbsd 5.0.1 (i386/1 cpu)
Automated smoke report for 5.11.0 patch 09a3ed31a73051acd8ed0511ea0d927d9660fd22 v5.11.0-106-g09a3ed3 p5netbsd: Intel 686-class (i386/1 cpu) on netbsd - 5.0.1 using cc version 4.1.3 20080704 prerelease (NetBSD nb2 20081120) smoketime 8 hours 30 minutes (average 1 hour 3 minutes) Summary: FAIL(F) O = OK F = Failure(s), extended report at the bottom X = Failure(s) under TEST but not under harness ? = still running or test results not (yet) available Build failures during: - = unknown or N/A c = Configure, m = make, M = make (after miniperl), t = make t...

Smoke [5.11.0] v5.11.0-1-g9911515 FAIL(F) openbsd 4.5 (i386/1 cpu)
Automated smoke report for 5.11.0 patch 99115150e3b424e330d9007fc4005e056210f907 v5.11.0-1-g9911515 p5openbsd: AMD Athlon(tm) Processor ("AuthenticAMD" 686-class, 256KB L2 cache) (909 MHz) (i386/1 cpu) on openbsd - 4.5 using cc version 3.3.5 (propolice) smoketime 12 hours 44 minutes (average 1 hour 35 minutes) Summary: FAIL(F) O = OK F = Failure(s), extended report at the bottom X = Failure(s) under TEST but not under harness ? = still running or test results not (yet) available Build failures during: - = unknown or N/A c = Configure, m = m...

Smoke [5.11.0] v5.11.0-17-g28e464f FAIL(F) openbsd 4.5 (i386/1 cpu)
Automated smoke report for 5.11.0 patch 28e464fba839d02f376952199261fc8b7d58a0d8 v5.11.0-17-g28e464f p5openbsd: AMD Athlon(tm) Processor ("AuthenticAMD" 686-class, 256KB L2 cache) (909 MHz) (i386/1 cpu) on openbsd - 4.5 using cc version 3.3.5 (propolice) smoketime 12 hours 46 minutes (average 1 hour 35 minutes) Summary: FAIL(F) O = OK F = Failure(s), extended report at the bottom X = Failure(s) under TEST but not under harness ? = still running or test results not (yet) available Build failures during: - = unknown or N/A c = Configure, m = ...

Smoke [5.11.0] v5.11.0-177-g63d690b FAIL(F) openbsd 4.5 (i386/1 cpu)
Automated smoke report for 5.11.0 patch 63d690b1f5b7e4a4f5cefe645e21a96651cbe9c2 v5.11.0-177-g63d690b p5openbsd: AMD Athlon(tm) Processor ("AuthenticAMD" 686-class, 256KB L2 cache) (909 MHz) (i386/1 cpu) on openbsd - 4.5 using cc version 3.3.5 (propolice) smoketime 12 hours 57 minutes (average 1 hour 37 minutes) Summary: FAIL(F) O = OK F = Failure(s), extended report at the bottom X = Failure(s) under TEST but not under harness ? = still running or test results not (yet) available Build failures during: - = unknown or N/A c = Configure, m =...

Smoke [5.11.0] v5.11.0-169-g50e225a FAIL(F) openbsd 4.5 (i386/1 cpu)
Automated smoke report for 5.11.0 patch 50e225a377de7c314b13cbaf39b6b423215d84a7 v5.11.0-169-g50e225a p5openbsd: AMD Athlon(tm) Processor ("AuthenticAMD" 686-class, 256KB L2 cache) (909 MHz) (i386/1 cpu) on openbsd - 4.5 using cc version 3.3.5 (propolice) smoketime 12 hours 55 minutes (average 1 hour 36 minutes) Summary: FAIL(F) O = OK F = Failure(s), extended report at the bottom X = Failure(s) under TEST but not under harness ? = still running or test results not (yet) available Build failures during: - = unknown or N/A c = Configure, m =...

Smoke [5.11.0] v5.11.0-74-g9e7c6af FAIL(F) openbsd 4.5 (i386/1 cpu)
Automated smoke report for 5.11.0 patch 9e7c6af37d3320462cbceb74b487ade8224b9191 v5.11.0-74-g9e7c6af p5openbsd: AMD Athlon(tm) Processor ("AuthenticAMD" 686-class, 256KB L2 cache) (909 MHz) (i386/1 cpu) on openbsd - 4.5 using cc version 3.3.5 (propolice) smoketime 12 hours 57 minutes (average 1 hour 37 minutes) Summary: FAIL(F) O = OK F = Failure(s), extended report at the bottom X = Failure(s) under TEST but not under harness ? = still running or test results not (yet) available Build failures during: - = unknown or N/A c = Configure, m = ...

Smoke [5.11.0] v5.11.0-219-g26c80ad FAIL(F) openbsd 4.5 (i386/1 cpu)
Automated smoke report for 5.11.0 patch 26c80adcc7731c0e4f1238e98e85fa2803538817 v5.11.0-219-g26c80ad p5openbsd: AMD Athlon(tm) Processor ("AuthenticAMD" 686-class, 256KB L2 cache) (909 MHz) (i386/1 cpu) on openbsd - 4.5 using cc version 3.3.5 (propolice) smoketime 12 hours 58 minutes (average 1 hour 37 minutes) Summary: FAIL(F) O = OK F = Failure(s), extended report at the bottom X = Failure(s) under TEST but not under harness ? = still running or test results not (yet) available Build failures during: - = unknown or N/A c = Configure, m =...

Smoke [5.11.0] v5.11.0-103-g1cce990 FAIL(F) openbsd 4.5 (i386/1 cpu)
Automated smoke report for 5.11.0 patch 1cce9906401b8a2db10f2d0061757627ad69f138 v5.11.0-103-g1cce990 p5openbsd: AMD Athlon(tm) Processor ("AuthenticAMD" 686-class, 256KB L2 cache) (909 MHz) (i386/1 cpu) on openbsd - 4.5 using cc version 3.3.5 (propolice) smoketime 12 hours 59 minutes (average 1 hour 37 minutes) Summary: FAIL(F) O = OK F = Failure(s), extended report at the bottom X = Failure(s) under TEST but not under harness ? = still running or test results not (yet) available Build failures during: - = unknown or N/A c = Configure, m =...

Smoke [5.11.0] v5.11.0-49-g5b7d14f FAIL(F) openbsd 4.5 (i386/1 cpu)
Automated smoke report for 5.11.0 patch 5b7d14ffe3988c7f70fd9dc76be9c44168d17a62 v5.11.0-49-g5b7d14f p5openbsd: AMD Athlon(tm) Processor ("AuthenticAMD" 686-class, 256KB L2 cache) (909 MHz) (i386/1 cpu) on openbsd - 4.5 using cc version 3.3.5 (propolice) smoketime 12 hours 58 minutes (average 1 hour 37 minutes) Summary: FAIL(F) O = OK F = Failure(s), extended report at the bottom X = Failure(s) under TEST but not under harness ? = still running or test results not (yet) available Build failures during: - = unknown or N/A c = Configure, m = ...

Smoke [5.11.0] v5.11.0-54-g68cbce5 FAIL(F) openbsd 4.5 (i386/1 cpu)
Automated smoke report for 5.11.0 patch 68cbce50efee2c3ae424cfe29c83b65d5b462b69 v5.11.0-54-g68cbce5 p5openbsd: AMD Athlon(tm) Processor ("AuthenticAMD" 686-class, 256KB L2 cache) (909 MHz) (i386/1 cpu) on openbsd - 4.5 using cc version 3.3.5 (propolice) smoketime 12 hours 58 minutes (average 1 hour 37 minutes) Summary: FAIL(F) O = OK F = Failure(s), extended report at the bottom X = Failure(s) under TEST but not under harness ? = still running or test results not (yet) available Build failures during: - = unknown or N/A c = Configure, m = ...

Smoke [5.11.0] v5.11.0-31-g2d5f1d0 FAIL(F) openbsd 4.5 (i386/1 cpu)
Automated smoke report for 5.11.0 patch 2d5f1d01166a325b29ccc86102d26e68def13786 v5.11.0-31-g2d5f1d0 p5openbsd: AMD Athlon(tm) Processor ("AuthenticAMD" 686-class, 256KB L2 cache) (909 MHz) (i386/1 cpu) on openbsd - 4.5 using cc version 3.3.5 (propolice) smoketime 12 hours 43 minutes (average 1 hour 35 minutes) Summary: FAIL(F) O = OK F = Failure(s), extended report at the bottom X = Failure(s) under TEST but not under harness ? = still running or test results not (yet) available Build failures during: - = unknown or N/A c = Configure, m = ...

Smoke [5.11.0] v5.11.0-12-gb9fb583 FAIL(F) openbsd 4.5 (i386/1 cpu)
Automated smoke report for 5.11.0 patch b9fb583619490a0ded37e01402169cea64f6c91e v5.11.0-12-gb9fb583 p5openbsd: AMD Athlon(tm) Processor ("AuthenticAMD" 686-class, 256KB L2 cache) (909 MHz) (i386/1 cpu) on openbsd - 4.5 using cc version 3.3.5 (propolice) smoketime 12 hours 45 minutes (average 1 hour 35 minutes) Summary: FAIL(F) O = OK F = Failure(s), extended report at the bottom X = Failure(s) under TEST but not under harness ? = still running or test results not (yet) available Build failures during: - = unknown or N/A c = Configure, m = ...

Smoke [5.11.0] v5.11.0-231-g8f3d599 FAIL(F) netbsd 5.0.1 (i386/1 cpu)
Automated smoke report for 5.11.0 patch 8f3d5996a665cf70e12a836b95e184e9ab628251 v5.11.0-231-g8f3d599 p5netbsd: Intel 686-class (i386/1 cpu) on netbsd - 5.0.1 using cc version 4.1.3 20080704 prerelease (NetBSD nb2 20081120) smoketime 6 hours 31 minutes (average 48 minutes 55 seconds) Summary: FAIL(F) O = OK F = Failure(s), extended report at the bottom X = Failure(s) under TEST but not under harness ? = still running or test results not (yet) available Build failures during: - = unknown or N/A c = Configure, m = make, M = make (after miniperl), t = m...

Smoke [5.11.0] v5.11.0-54-g68cbce5 FAIL(F) netbsd 5.0.1 (i386/1 cpu)
Automated smoke report for 5.11.0 patch 68cbce50efee2c3ae424cfe29c83b65d5b462b69 v5.11.0-54-g68cbce5 p5netbsd: Intel 686-class (i386/1 cpu) on netbsd - 5.0.1 using cc version 4.1.3 20080704 prerelease (NetBSD nb2 20081120) smoketime 8 hours 24 minutes (average 1 hour 3 minutes) Summary: FAIL(F) O = OK F = Failure(s), extended report at the bottom X = Failure(s) under TEST but not under harness ? = still running or test results not (yet) available Build failures during: - = unknown or N/A c = Configure, m = make, M = make (after miniperl), t = make te...

Web resources about - Smoke [5.11.0] v5.11.0-106-g09a3ed3 FAIL(F) openbsd 4.5 (i386/1 cpu) - perl.perl5.porters

Windows 7 To Be Left Vulnerable To Viruses And Security Problems As Microsoft Continues To Push Windows ...
Ever since Microsoft launched the Windows 10 operating system in July last year, it has consistently campaigned for PC users to make the upgrade ...

Twitter overhaul? Your tweets could soon be 10000 characters long
CBS News Twitter overhaul? Your tweets could soon be 10000 characters long CBS News Tweets are known for their brevity, and at 140 characters ...

Bless This Sweet Little Star Wars Kickstarter
Devin Tripp, from Grapevine, Texas, says he is 20 years old. His is not the first name that springs to mind when you’re thinking of development ...

Trials Set for Deputies Charged in La. Boy's Fatal Shooting
Judge sets separate trials for 2 deputy city marshals charged in boy's fatal shooting

‘Making a Murderer’ Victim, Juror on Steven Avery Case
Penny Beernsten, the rape victim in Netflix’s wildly popular docu-series “Making a Murderer,” spoke out to the Marshall Project about her role ...

How Saudi Arabia's Spat With Iran Affects the US
TIME How Saudi Arabia's Spat With Iran Affects the US TIME The latest episode of the long-running conflict between Saudi Arabia and Iran has ...

Smart, Good Man Prowls Bravo Star's House While Naked in a Ronald Reagan Mask
Today in What a Time to Be Alive: an as yet unidentified man celebrated New Year’s Eve by prowling around the Vestavia Hills house of Jersey ...

Authorities Want to Cut Power to Wildlife Refuge in the Hope of Freezing the Armed Outlaws
Turkey vultures in the wildlife refuge currently occupied by rogue ranchers. The birds are waiting for something to die. Hugh K Telleria/ shutterstock.com ...

Five economic fears behind the Chinese stock slide that shook world markets
For the second time in less than six months, concerns about China’s rocky transition from an export-fueled industrial nation to a more mature ...

New Year's Eve Mass Shutter Report: Brasserie, Costata, City Hall, and More Close
Here's a roundup of all the restaurants that closed — temporarily or permanently — after service on New Year's Eve. — After a 15 year off-Broadway ...

Resources last updated: 1/6/2016 12:42:06 AM