Smoke [5.10.1] perl-5.10.1-RC1-30-ga3929e2 FAIL(F) netbsd 5.0.1 (i386/1 cpu)

Automated smoke report for 5.10.1 patch a3929e2d04da78f1e4fb19121feb28e87f556fb0 perl-5.10.1-RC1-30-ga3929e2
p5netbsd: Intel 686-class (i386/1 cpu)
    on        netbsd - 5.0.1
    using     cc version 4.1.3 20080704 prerelease (NetBSD nb2 20081120)
    smoketime 7 hours 11 minutes (average 53 minutes 56 seconds)

Summary: FAIL(F)

O = OK  F = Failure(s), extended report at the bottom
X = Failure(s) under TEST but not under harness
? = still running or test results not (yet) available
Build failures during:       - = unknown or N/A
c = Configure, m = make, M = make (after miniperl), t = make test-prep

perl-5.10.1-RC1-30-ga3929e2  Configuration (common) none
----------- ---------------------------------------------------------
F F F F     
F F F F     -Duse64bitint
F F F F     -Duseithreads
F F F F     -Duseithreads -Duse64bitint
| | | +----- PERLIO = perlio -DDEBUGGING
| | +------- PERLIO = stdio  -DDEBUGGING
| +--------- PERLIO = perlio
+----------- PERLIO = stdio


Locally applied patches:
    SMOKEa3929e2d04da78f1e4fb19121feb28e87f556fb0

Failures: (common-args) none
[stdio] 
    ../lib/CPANPLUS/t/04_CPANPLUS-Module.t......................FAILED
        109
    ../lib/CPANPLUS/Dist/Build/t/02_CPANPLUS-Dist-Build.t.......FAILED
        11-16, 20, 23, 26-31, 37
    ../lib/Archive/Extract/t/01_Archive-Extract.t...............FAILED
        35, 37-42, 61-66, 107, 109-110, 112-114
        131, 133-138, 157-162, 191, 193-198, 217-222
        239, 241-246, 265-270, 287, 289-294, 313-318
        347, 349-354, 373-378, 395, 397-398, 400-402
        419, 421-426, 445-450, 467, 469-470, 472-474
        527, 529-534, 553-558
    ../lib/CPANPLUS/t/20_CPANPLUS-Dist-MM.t.....................FAILED
        11-12, 14, 17-18, 41-43
    ../lib/CPANPLUS/t/19_CPANPLUS-Dist.t........................FAILED
        33, 37, 50
    ../t/io/dup.t...............................................FAILED
        15-16
    ../lib/IPC/Cmd/t/01_IPC-Cmd.t...............................FAILED
        17-18, 23-24, 26-29, 34-35, 37-40, 45-46
        48-51, 56-57, 59-62, 67-68, 70-73, 78-79
        81-84, 89-90, 92-95, 100-101, 103-106, 111-112
        114-117, 122-123, 125-128, 133-134, 136-139
        144-145, 147-150, 155-156, 158-161, 166-167
        169-172, 177-178, 180-183, 188-189, 191-194
        199-200, 202-205, 210-211, 213-216, 221-222
        224-227, 232-233
    ../t/io/open.t..............................................FAILED
        93

[perlio] 
    ../lib/CPANPLUS/t/04_CPANPLUS-Module.t......................FAILED
        109
    ../lib/CPANPLUS/Dist/Build/t/02_CPANPLUS-Dist-Build.t.......FAILED
        11-16, 20, 23, 26-31, 37
    ../lib/Archive/Extract/t/01_Archive-Extract.t...............FAILED
        35, 37-42, 61-66, 107, 109-110, 112-114
        131, 133-138, 157-162, 191, 193-198, 217-222
        239, 241-246, 265-270, 287, 289-294, 313-318
        347, 349-354, 373-378, 395, 397-398, 400-402
        419, 421-426, 445-450, 467, 469-470, 472-474
        527, 529-534, 553-558
    ../lib/CPANPLUS/t/20_CPANPLUS-Dist-MM.t.....................FAILED
        11-12, 14, 17-18, 41-43
    ../lib/CPANPLUS/t/19_CPANPLUS-Dist.t........................FAILED
        33, 37, 61
    ../t/io/dup.t...............................................FAILED
        15-16
    ../lib/IPC/Cmd/t/01_IPC-Cmd.t...............................FAILED
        17-18, 23-24, 26-29, 34-35, 37-40, 45-46
        48-51, 56-57, 59-62, 67-68, 70-73, 78-79
        81-84, 89-90, 92-95, 100-101, 103-106, 111-112
        114-117, 122-123, 125-128, 133-134, 136-139
        144-145, 147-150, 155-156, 158-161, 166-167
        169-172, 177-178, 180-183, 188-189, 191-194
        199-200, 202-205, 210-211, 213-216, 221-222
        224-227, 232-233
    ../t/io/open.t..............................................FAILED
        93

[stdio] -DDEBUGGING
    ../lib/CPANPLUS/t/04_CPANPLUS-Module.t......................FAILED
        109
    ../lib/CPANPLUS/Dist/Build/t/02_CPANPLUS-Dist-Build.t.......FAILED
        11-16, 20, 23, 26-31, 37
    ../lib/Archive/Extract/t/01_Archive-Extract.t...............FAILED
        35, 37-42, 61-66, 107, 109-110, 112-114
        131, 133-138, 157-162, 191, 193-198, 217-222
        239, 241-246, 265-270, 287, 289-294, 313-318
        347, 349-354, 373-378, 395, 397-398, 400-402
        419, 421-426, 445-450, 467, 469-470, 472-474
        527, 529-534, 553-558
    ../lib/CPANPLUS/t/20_CPANPLUS-Dist-MM.t.....................FAILED
        8-9
    ../t/io/dup.t...............................................FAILED
        15-16
    ../t/io/open.t..............................................FAILED
        93
    ../lib/IPC/Cmd/t/01_IPC-Cmd.t...............................FAILED
        17-18, 23-24, 26-29, 34-35, 37-40, 45-46
        48-51, 56-57, 59-62, 67-68, 70-73, 78-79
        81-84, 89-90, 92-95, 100-101, 103-106, 111-112
        114-117, 122-123, 125-128, 133-134, 136-139
        144-145, 147-150, 155-156, 158-161, 166-167
        169-172, 177-178, 180-183, 188-189, 191-194
        199-200, 202-205, 210-211, 213-216, 221-222
        224-227, 232-233
    ../lib/CPANPLUS/t/19_CPANPLUS-Dist.t........................FAILED
        33, 62-63

[perlio] -DDEBUGGING
    ../lib/CPANPLUS/t/04_CPANPLUS-Module.t......................FAILED
        109
    ../lib/CPANPLUS/Dist/Build/t/02_CPANPLUS-Dist-Build.t.......FAILED
        11-16, 20, 23, 26-31, 37
    ../lib/Archive/Extract/t/01_Archive-Extract.t...............FAILED
        35, 37-42, 61-66, 107, 109-110, 112-114
        131, 133-138, 157-162, 191, 193-198, 217-222
        239, 241-246, 265-270, 287, 289-294, 313-318
        347, 349-354, 373-378, 395, 397-398, 400-402
        419, 421-426, 445-450, 467, 469-470, 472-474
        527, 529-534, 553-558
    ../lib/CPANPLUS/t/20_CPANPLUS-Dist-MM.t.....................FAILED
        11-12, 14, 17-18, 42
    ../lib/CPANPLUS/t/19_CPANPLUS-Dist.t........................FAILED
        62-63, 67
    ../t/io/dup.t...............................................FAILED
        15-16
    ../lib/IPC/Cmd/t/01_IPC-Cmd.t...............................FAILED
        17-18, 23-24, 26-29, 34-35, 37-40, 45-46
        48-51, 56-57, 59-62, 67-68, 70-73, 78-79
        81-84, 89-90, 92-95, 100-101, 103-106, 111-112
        114-117, 122-123, 125-128, 133-134, 136-139
        144-145, 147-150, 155-156, 158-161, 166-167
        169-172, 177-178, 180-183, 188-189, 191-194
        199-200, 202-205, 210-211, 213-216, 221-222
        224-227, 232-233
    ../t/io/open.t..............................................FAILED
        93

[stdio] -Duse64bitint
    ../lib/CPANPLUS/t/04_CPANPLUS-Module.t......................FAILED
        109
    ../lib/CPANPLUS/Dist/Build/t/02_CPANPLUS-Dist-Build.t.......FAILED
        11-16, 20, 23, 26-31, 37
    ../lib/Archive/Extract/t/01_Archive-Extract.t...............FAILED
        35, 37-42, 61-66, 107, 109-110, 112-114
        131, 133-138, 157-162, 191, 193-198, 217-222
        239, 241-246, 265-270, 287, 289-294, 313-318
        347, 349-354, 373-378, 395, 397-398, 400-402
        419, 421-426, 445-450, 467, 469-470, 472-474
        527, 529-534, 553-558
    ../lib/CPANPLUS/t/19_CPANPLUS-Dist.t........................FAILED
        33, 37, 50
    ../lib/CPANPLUS/t/20_CPANPLUS-Dist-MM.t.....................FAILED
        11-12, 14, 17-18, 41-43
    ../t/io/dup.t...............................................FAILED
        15-16
    ../lib/IPC/Cmd/t/01_IPC-Cmd.t...............................FAILED
        17-18, 23-24, 26-29, 34-35, 37-40, 45-46
        48-51, 56-57, 59-62, 67-68, 70-73, 78-79
        81-84, 89-90, 92-95, 100-101, 103-106, 111-112
        114-117, 122-123, 125-128, 133-134, 136-139
        144-145, 147-150, 155-156, 158-161, 166-167
        169-172, 177-178, 180-183, 188-189, 191-194
        199-200, 202-205, 210-211, 213-216, 221-222
        224-227, 232-233
    ../t/io/open.t..............................................FAILED
        93

[perlio] -Duse64bitint
    ../lib/CPANPLUS/t/04_CPANPLUS-Module.t......................FAILED
        109
    ../lib/CPANPLUS/Dist/Build/t/02_CPANPLUS-Dist-Build.t.......FAILED
        11-16, 20, 23, 26-31, 37
    ../lib/CPANPLUS/t/20_CPANPLUS-Dist-MM.t.....................FAILED
        8-9
    ../lib/CPANPLUS/t/19_CPANPLUS-Dist.t........................FAILED
        33, 37, 39
    ../lib/Archive/Extract/t/01_Archive-Extract.t...............FAILED
        35, 37-42, 61-66, 107, 109-110, 112-114
        131, 133-138, 157-162, 191, 193-198, 217-222
        239, 241-246, 265-270, 287, 289-294, 313-318
        347, 349-354, 373-378, 395, 397-398, 400-402
        419, 421-426, 445-450, 467, 469-470, 472-474
        527, 529-534, 553-558
    ../t/io/dup.t...............................................FAILED
        15-16
    ../lib/IPC/Cmd/t/01_IPC-Cmd.t...............................FAILED
        17-18, 23-24, 26-29, 34-35, 37-40, 45-46
        48-51, 56-57, 59-62, 67-68, 70-73, 78-79
        81-84, 89-90, 92-95, 100-101, 103-106, 111-112
        114-117, 122-123, 125-128, 133-134, 136-139
        144-145, 147-150, 155-156, 158-161, 166-167
        169-172, 177-178, 180-183, 188-189, 191-194
        199-200, 202-205, 210-211, 213-216, 221-222
        224-227, 232-233
    ../t/io/open.t..............................................FAILED
        93

[stdio] -DDEBUGGING -Duse64bitint
    ../lib/CPANPLUS/t/04_CPANPLUS-Module.t......................FAILED
        109
    ../lib/CPANPLUS/Dist/Build/t/02_CPANPLUS-Dist-Build.t.......FAILED
        11-16, 20, 23, 26-31, 37
    ../lib/Archive/Extract/t/01_Archive-Extract.t...............FAILED
        35, 37-42, 61-66, 107, 109-110, 112-114
        131, 133-138, 157-162, 191, 193-198, 217-222
        239, 241-246, 265-270, 287, 289-294, 313-318
        347, 349-354, 373-378, 395, 397-398, 400-402
        419, 421-426, 445-450, 467, 469-470, 472-474
        527, 529-534, 553-558
    ../lib/CPANPLUS/t/20_CPANPLUS-Dist-MM.t.....................FAILED
        11-12, 14, 17-18, 42
    ../lib/CPANPLUS/t/19_CPANPLUS-Dist.t........................FAILED
        58
    ../lib/IPC/Cmd/t/01_IPC-Cmd.t...............................FAILED
        17-18, 23-24, 26-29, 34-35, 37-40, 45-46
        48-51, 56-57, 59-62, 67-68, 70-73, 78-79
        81-84, 89-90, 92-95, 100-101, 103-106, 111-112
        114-117, 122-123, 125-128, 133-134, 136-139
        144-145, 147-150, 155-156, 158-161, 166-167
        169-172, 177-178, 180-183, 188-189, 191-194
        199-200, 202-205, 210-211, 213-216, 221-222
        224-227, 232-233
    ../t/io/dup.t...............................................FAILED
        15-16
    ../t/io/open.t..............................................FAILED
        93

[perlio] -DDEBUGGING -Duse64bitint
    ../lib/CPANPLUS/t/04_CPANPLUS-Module.t......................FAILED
        109
    ../lib/CPANPLUS/Dist/Build/t/02_CPANPLUS-Dist-Build.t.......FAILED
        11-16, 20, 23, 26-31, 37
    ../lib/Archive/Extract/t/01_Archive-Extract.t...............FAILED
        35, 37-42, 61-66, 107, 109-110, 112-114
        131, 133-138, 157-162, 191, 193-198, 217-222
        239, 241-246, 265-270, 287, 289-294, 313-318
        347, 349-354, 373-378, 395, 397-398, 400-402
        419, 421-426, 445-450, 467, 469-470, 472-474
        527, 529-534, 553-558
    ../lib/CPANPLUS/t/20_CPANPLUS-Dist-MM.t.....................FAILED
        11-12, 14, 17-18, 42
    ../lib/CPANPLUS/t/19_CPANPLUS-Dist.t........................FAILED
        25, 29-30, 58
    ../t/io/dup.t...............................................FAILED
        15-16
    ../lib/IPC/Cmd/t/01_IPC-Cmd.t...............................FAILED
        17-18, 23-24, 26-29, 34-35, 37-40, 45-46
        48-51, 56-57, 59-62, 67-68, 70-73, 78-79
        81-84, 89-90, 92-95, 100-101, 103-106, 111-112
        114-117, 122-123, 125-128, 133-134, 136-139
        144-145, 147-150, 155-156, 158-161, 166-167
        169-172, 177-178, 180-183, 188-189, 191-194
        199-200, 202-205, 210-211, 213-216, 221-222
        224-227, 232-233
    ../t/io/open.t..............................................FAILED
        93

[stdio] -Duseithreads
    ../lib/CPANPLUS/t/04_CPANPLUS-Module.t......................FAILED
        109
    ../lib/CPANPLUS/Dist/Build/t/02_CPANPLUS-Dist-Build.t.......FAILED
        11-16, 20, 23, 26-31, 37
    ../lib/Archive/Extract/t/01_Archive-Extract.t...............FAILED
        35, 37-42, 61-66, 107, 109-110, 112-114
        131, 133-138, 157-162, 191, 193-198, 217-222
        239, 241-246, 265-270, 287, 289-294, 313-318
        347, 349-354, 373-378, 395, 397-398, 400-402
        419, 421-426, 445-450, 467, 469-470, 472-474
        527, 529-534, 553-558
    ../lib/CPANPLUS/t/20_CPANPLUS-Dist-MM.t.....................FAILED
        8-9
    ../lib/CPANPLUS/t/19_CPANPLUS-Dist.t........................FAILED
        35
    ../t/io/dup.t...............................................FAILED
        15-16
    ../lib/IPC/Cmd/t/01_IPC-Cmd.t...............................FAILED
        17-18, 23-24, 26-29, 34-35, 37-40, 45-46
        48-51, 56-57, 59-62, 67-68, 70-73, 78-79
        81-84, 89-90, 92-95, 100-101, 103-106, 111-112
        114-117, 122-123, 125-128, 133-134, 136-139
        144-145, 147-150, 155-156, 158-161, 166-167
        169-172, 177-178, 180-183, 188-189, 191-194
        199-200, 202-205, 210-211, 213-216, 221-222
        224-227, 232-233
    ../t/io/open.t..............................................FAILED
        93

[perlio] -Duseithreads
    ../lib/CPANPLUS/t/04_CPANPLUS-Module.t......................FAILED
        109
    ../lib/CPANPLUS/Dist/Build/t/02_CPANPLUS-Dist-Build.t.......FAILED
        11-16, 20, 23, 26-31, 37
    ../lib/CPANPLUS/t/19_CPANPLUS-Dist.t........................FAILED
        2-6
    ../lib/Archive/Extract/t/01_Archive-Extract.t...............FAILED
        35, 37-42, 61-66, 107, 109-110, 112-114
        131, 133-138, 157-162, 191, 193-198, 217-222
        239, 241-246, 265-270, 287, 289-294, 313-318
        347, 349-354, 373-378, 395, 397-398, 400-402
        419, 421-426, 445-450, 467, 469-470, 472-474
        527, 529-534, 553-558
    ../t/io/dup.t...............................................FAILED
        15-16
    ../t/io/open.t..............................................FAILED
        93
    ../lib/IPC/Cmd/t/01_IPC-Cmd.t...............................FAILED
        17-18, 23-24, 26-29, 34-35, 37-40, 45-46
        48-51, 56-57, 59-62, 67-68, 70-73, 78-79
        81-84, 89-90, 92-95, 100-101, 103-106, 111-112
        114-117, 122-123, 125-128, 133-134, 136-139
        144-145, 147-150, 155-156, 158-161, 166-167
        169-172, 177-178, 180-183, 188-189, 191-194
        199-200, 202-205, 210-211, 213-216, 221-222
        224-227, 232-233
    ../lib/CPANPLUS/t/20_CPANPLUS-Dist-MM.t.....................FAILED
        11-12, 14, 17-18, 42

[stdio] -DDEBUGGING -Duseithreads
    ../lib/CPANPLUS/t/04_CPANPLUS-Module.t......................FAILED
        109
    ../lib/CPANPLUS/Dist/Build/t/02_CPANPLUS-Dist-Build.t.......FAILED
        11-16, 20, 23, 26-31, 37
    ../lib/Archive/Extract/t/01_Archive-Extract.t...............FAILED
        35, 37-42, 61-66, 107, 109-110, 112-114
        131, 133-138, 157-162, 191, 193-198, 217-222
        239, 241-246, 265-270, 287, 289-294, 313-318
        347, 349-354, 373-378, 395, 397-398, 400-402
        419, 421-426, 445-450, 467, 469-470, 472-474
        527, 529-534, 553-558
    ../lib/CPANPLUS/t/19_CPANPLUS-Dist.t........................FAILED
        31
    ../t/io/dup.t...............................................FAILED
        15-16
    ../t/io/open.t..............................................FAILED
        93
    ../lib/IPC/Cmd/t/01_IPC-Cmd.t...............................FAILED
        17-18, 23-24, 26-29, 34-35, 37-40, 45-46
        48-51, 56-57, 59-62, 67-68, 70-73, 78-79
        81-84, 89-90, 92-95, 100-101, 103-106, 111-112
        114-117, 122-123, 125-128, 133-134, 136-139
        144-145, 147-150, 155-156, 158-161, 166-167
        169-172, 177-178, 180-183, 188-189, 191-194
        199-200, 202-205, 210-211, 213-216, 221-222
        224-227, 232-233
    ../lib/CPANPLUS/t/20_CPANPLUS-Dist-MM.t.....................FAILED
        11-12, 14, 17-18, 42

[perlio] -DDEBUGGING -Duseithreads
    ../lib/CPANPLUS/t/04_CPANPLUS-Module.t......................FAILED
        109
    ../lib/CPANPLUS/Dist/Build/t/02_CPANPLUS-Dist-Build.t.......FAILED
        11-16, 20, 23, 26-31, 37
    ../lib/Archive/Extract/t/01_Archive-Extract.t...............FAILED
        35, 37-42, 61-66, 107, 109-110, 112-114
        131, 133-138, 157-162, 191, 193-198, 217-222
        239, 241-246, 265-270, 287, 289-294, 313-318
        347, 349-354, 373-378, 395, 397-398, 400-402
        419, 421-426, 445-450, 467, 469-470, 472-474
        527, 529-534, 553-558
    ../lib/CPANPLUS/t/20_CPANPLUS-Dist-MM.t.....................FAILED
        11-12, 14, 17-18, 42
    ../lib/CPANPLUS/t/19_CPANPLUS-Dist.t........................FAILED
        55
    ../t/io/dup.t...............................................FAILED
        15-16
    ../lib/IPC/Cmd/t/01_IPC-Cmd.t...............................FAILED
        17-18, 23-24, 26-29, 34-35, 37-40, 45-46
        48-51, 56-57, 59-62, 67-68, 70-73, 78-79
        81-84, 89-90, 92-95, 100-101, 103-106, 111-112
        114-117, 122-123, 125-128, 133-134, 136-139
        144-145, 147-150, 155-156, 158-161, 166-167
        169-172, 177-178, 180-183, 188-189, 191-194
        199-200, 202-205, 210-211, 213-216, 221-222
        224-227, 232-233
    ../t/io/open.t..............................................FAILED
        93

[stdio] -Duseithreads -Duse64bitint
    ../lib/CPANPLUS/Dist/Build/t/02_CPANPLUS-Dist-Build.t.......FAILED
        11-16, 20, 23, 26-31, 37
    ../lib/CPANPLUS/t/04_CPANPLUS-Module.t......................FAILED
        109
    ../lib/CPANPLUS/t/19_CPANPLUS-Dist.t........................FAILED
        31
    ../lib/Archive/Extract/t/01_Archive-Extract.t...............FAILED
        35, 37-42, 61-66, 107, 109-110, 112-114
        131, 133-138, 157-162, 191, 193-198, 217-222
        239, 241-246, 265-270, 287, 289-294, 313-318
        347, 349-354, 373-378, 395, 397-398, 400-402
        419, 421-426, 445-450, 467, 469-470, 472-474
        527, 529-534, 553-558
    ../t/io/dup.t...............................................FAILED
        15-16
    ../t/io/open.t..............................................FAILED
        93
    ../lib/IPC/Cmd/t/01_IPC-Cmd.t...............................FAILED
        17-18, 23-24, 26-29, 34-35, 37-40, 45-46
        48-51, 56-57, 59-62, 67-68, 70-73, 78-79
        81-84, 89-90, 92-95, 100-101, 103-106, 111-112
        114-117, 122-123, 125-128, 133-134, 136-139
        144-145, 147-150, 155-156, 158-161, 166-167
        169-172, 177-178, 180-183, 188-189, 191-194
        199-200, 202-205, 210-211, 213-216, 221-222
        224-227, 232-233
    ../lib/CPANPLUS/t/20_CPANPLUS-Dist-MM.t.....................FAILED
        11-12, 14, 17-18, 42

[perlio] -Duseithreads -Duse64bitint
    ../lib/CPANPLUS/t/04_CPANPLUS-Module.t......................FAILED
        109
    ../lib/CPANPLUS/Dist/Build/t/02_CPANPLUS-Dist-Build.t.......FAILED
        11-16, 20, 23, 26-31, 37
    ../lib/Archive/Extract/t/01_Archive-Extract.t...............FAILED
        35, 37-42, 61-66, 107, 109-110, 112-114
        131, 133-138, 157-162, 191, 193-198, 217-222
        239, 241-246, 265-270, 287, 289-294, 313-318
        347, 349-354, 373-378, 395, 397-398, 400-402
        419, 421-426, 445-450, 467, 469-470, 472-474
        527, 529-534, 553-558
    ../lib/CPANPLUS/t/20_CPANPLUS-Dist-MM.t.....................FAILED
        11-12, 14, 17-18, 41-43
    ../lib/CPANPLUS/t/19_CPANPLUS-Dist.t........................FAILED
        25, 29-30, 33, 37, 50
    ../t/io/dup.t...............................................FAILED
        15-16
    ../lib/IPC/Cmd/t/01_IPC-Cmd.t...............................FAILED
        17-18, 23-24, 26-29, 34-35, 37-40, 45-46
        48-51, 56-57, 59-62, 67-68, 70-73, 78-79
        81-84, 89-90, 92-95, 100-101, 103-106, 111-112
        114-117, 122-123, 125-128, 133-134, 136-139
        144-145, 147-150, 155-156, 158-161, 166-167
        169-172, 177-178, 180-183, 188-189, 191-194
        199-200, 202-205, 210-211, 213-216, 221-222
        224-227, 232-233
    ../t/io/open.t..............................................FAILED
        93

[stdio] -DDEBUGGING -Duseithreads -Duse64bitint
    ../lib/CPANPLUS/t/04_CPANPLUS-Module.t......................FAILED
        109
    ../lib/CPANPLUS/Dist/Build/t/02_CPANPLUS-Dist-Build.t.......FAILED
        11-16, 20, 23, 26-31, 37
    ../lib/Archive/Extract/t/01_Archive-Extract.t...............FAILED
        35, 37-42, 61-66, 107, 109-110, 112-114
        131, 133-138, 157-162, 191, 193-198, 217-222
        239, 241-246, 265-270, 287, 289-294, 313-318
        347, 349-354, 373-378, 395, 397-398, 400-402
        419, 421-426, 445-450, 467, 469-470, 472-474
        527, 529-534, 553-558
    ../lib/CPANPLUS/t/19_CPANPLUS-Dist.t........................FAILED
        24-25, 29-31
    ../t/io/dup.t...............................................FAILED
        15-16
    ../t/io/open.t..............................................FAILED
        93
    ../lib/IPC/Cmd/t/01_IPC-Cmd.t...............................FAILED
        17-18, 23-24, 26-29, 34-35, 37-40, 45-46
        48-51, 56-57, 59-62, 67-68, 70-73, 78-79
        81-84, 89-90, 92-95, 100-101, 103-106, 111-112
        114-117, 122-123, 125-128, 133-134, 136-139
        144-145, 147-150, 155-156, 158-161, 166-167
        169-172, 177-178, 180-183, 188-189, 191-194
        199-200, 202-205, 210-211, 213-216, 221-222
        224-227, 232-233
    ../lib/CPANPLUS/t/20_CPANPLUS-Dist-MM.t.....................FAILED
        11-12, 14, 17-18, 42

[perlio] -DDEBUGGING -Duseithreads -Duse64bitint
    ../lib/CPANPLUS/t/04_CPANPLUS-Module.t......................FAILED
        109
    ../lib/CPANPLUS/Dist/Build/t/02_CPANPLUS-Dist-Build.t.......FAILED
        11-16, 20, 23, 26-31, 37
    ../lib/CPANPLUS/t/19_CPANPLUS-Dist.t........................FAILED
        31
    ../lib/Archive/Extract/t/01_Archive-Extract.t...............FAILED
        35, 37-42, 61-66, 107, 109-110, 112-114
        131, 133-138, 157-162, 191, 193-198, 217-222
        239, 241-246, 265-270, 287, 289-294, 313-318
        347, 349-354, 373-378, 395, 397-398, 400-402
        419, 421-426, 445-450, 467, 469-470, 472-474
        527, 529-534, 553-558
    ../t/io/dup.t...............................................FAILED
        15-16
    ../t/io/open.t..............................................FAILED
        93
    ../lib/CPANPLUS/t/20_CPANPLUS-Dist-MM.t.....................FAILED
        11-12, 14, 17-18, 42
    ../lib/IPC/Cmd/t/01_IPC-Cmd.t...............................FAILED
        17-18, 23-24, 26-29, 34-35, 37-40, 45-46
        48-51, 56-57, 59-62, 67-68, 70-73, 78-79
        81-84, 89-90, 92-95, 100-101, 103-106, 111-112
        114-117, 122-123, 125-128, 133-134, 136-139
        144-145, 147-150, 155-156, 158-161, 166-167
        169-172, 177-178, 180-183, 188-189, 191-194
        199-200, 202-205, 210-211, 213-216, 221-222
        224-227, 232-233

Compiler messages(gcc):
perlio.c: In function 'PerlIOStdio_set_ptrcnt':
perlio.c:3450: warning: pointer targets in assignment differ in signedness
Peek.c: In function 'XS_Devel__Peek_mstat':
Peek.c:391: warning: passing argument 1 of 'Perl_dump_mstats' discards qualifiers from pointer target type
<command line>:1:1: warning: "TIME_HIRES_STAT" redefined
<command line>:1:1: warning: this is the location of the previous definition
/usr/include/sys/cdefs_elf.h:67:20: error: missing binary operator before token "("
Peek.c:391: warning: passing argument 2 of 'Perl_dump_mstats' discards qualifiers from pointer target type

-- 
Report by Test::Smoke v1.40 build 1242 running on perl 5.10.0
(Reporter v0.035 / Smoker v0.044)
0
stsc
8/13/2009 9:18:43 PM
perl.perl5.porters 48287 articles. 1 followers. Follow

0 Replies
918 Views

Similar Articles

[PageSpeed] 42

Reply:

Similar Artilces:

Smoke [5.10.0] maint-5.10-346-gb941d8b FAIL(F) netbsd 4.0.1 (i386/1 cpu)
Automated smoke report for 5.10.0 patch b941d8bbf1cec8924975fbd33e853485c15eb066 maint-5.10-346-gb941d8b p5netbsd: AMD Duron (686-class) (i386/1 cpu) on netbsd - 4.0.1 using cc version 4.1.2 20061021 prerelease (NetBSD nb3 20061125) smoketime 22 hours 40 minutes (average 2 hours 50 minutes) Summary: FAIL(F) O = OK F = Failure(s), extended report at the bottom X = Failure(s) under TEST but not under harness ? = still running or test results not (yet) available Build failures during: - = unknown or N/A c = Configure, m = make, M = make (after miniperl)...

Smoke [5.10.0] maint-5.10-598-g331b76d FAIL(F) netbsd 4.0.1 (i386/1 cpu)
Automated smoke report for 5.10.0 patch 331b76decc59416d8320ad49a4fba9fed874a177 maint-5.10-598-g331b76d p5netbsd: AMD Duron (686-class) (i386/1 cpu) on netbsd - 4.0.1 using cc version 4.1.2 20061021 prerelease (NetBSD nb3 20061125) smoketime 16 hours 44 minutes (average 2 hours 5 minutes) Summary: FAIL(F) O = OK F = Failure(s), extended report at the bottom X = Failure(s) under TEST but not under harness ? = still running or test results not (yet) available Build failures during: - = unknown or N/A c = Configure, m = make, M = make (after miniperl),...

Smoke [5.10.0] maint-5.10-459-g6a49472 FAIL(F) netbsd 4.0.1 (i386/1 cpu)
Automated smoke report for 5.10.0 patch 6a4947285303421b2ef88204489fbfd215e26389 maint-5.10-459-g6a49472 p5netbsd: AMD Duron (686-class) (i386/1 cpu) on netbsd - 4.0.1 using cc version 4.1.2 20061021 prerelease (NetBSD nb3 20061125) smoketime 21 hours 53 minutes (average 2 hours 44 minutes) Summary: FAIL(F) O = OK F = Failure(s), extended report at the bottom X = Failure(s) under TEST but not under harness ? = still running or test results not (yet) available Build failures during: - = unknown or N/A c = Configure, m = make, M = make (after miniperl)...

Smoke [5.10.0] maint-5.10-328-gbcd41b7 FAIL(F) netbsd 4.0.1 (i386/1 cpu)
Automated smoke report for 5.10.0 patch bcd41b7997abaa21e066e80f23cd72857f8f5f56 maint-5.10-328-gbcd41b7 p5netbsd: AMD Duron (686-class) (i386/1 cpu) on netbsd - 4.0.1 using cc version 4.1.2 20061021 prerelease (NetBSD nb3 20061125) smoketime 14 hours 12 minutes (average 1 hour 46 minutes) Summary: FAIL(F) O = OK F = Failure(s), extended report at the bottom X = Failure(s) under TEST but not under harness ? = still running or test results not (yet) available Build failures during: - = unknown or N/A c = Configure, m = make, M = make (after miniperl),...

Smoke [5.10.0] maint-5.10-299-g1625989 FAIL(F) netbsd 4.0.1 (i386/1 cpu)
Automated smoke report for 5.10.0 patch 16259899a80a8de3fd74bd26a6308681f03dac63 maint-5.10-299-g1625989 p5netbsd: AMD Duron (686-class) (i386/1 cpu) on netbsd - 4.0.1 using cc version 4.1.2 20061021 prerelease (NetBSD nb3 20061125) smoketime 21 hours 43 minutes (average 2 hours 42 minutes) Summary: FAIL(F) O = OK F = Failure(s), extended report at the bottom X = Failure(s) under TEST but not under harness ? = still running or test results not (yet) available Build failures during: - = unknown or N/A c = Configure, m = make, M = make (after miniperl)...

Smoke [5.10.0] maint-5.10-381-g136f962 FAIL(F) netbsd 4.0.1 (i386/1 cpu)
Automated smoke report for 5.10.0 patch 136f96283a398f49aa36b7d47086bf37fd04c4b4 maint-5.10-381-g136f962 p5netbsd: AMD Duron (686-class) (i386/1 cpu) on netbsd - 4.0.1 using cc version 4.1.2 20061021 prerelease (NetBSD nb3 20061125) smoketime 22 hours 37 minutes (average 2 hours 49 minutes) Summary: FAIL(F) O = OK F = Failure(s), extended report at the bottom X = Failure(s) under TEST but not under harness ? = still running or test results not (yet) available Build failures during: - = unknown or N/A c = Configure, m = make, M = make (after miniperl)...

Smoke [5.10.0] maint-5.10-1079-ga9d5891 FAIL(F) netbsd 4.0.1 (i386/1 cpu)
Automated smoke report for 5.10.0 patch a9d58912b709187ad8c9e439b72b3a14130d36d8 maint-5.10-1079-ga9d5891 p5netbsd: AMD Duron (686-class) (i386/1 cpu) on netbsd - 4.0.1 using cc version 4.1.2 20061021 prerelease (NetBSD nb3 20061125) smoketime 18 hours 22 minutes (average 2 hours 17 minutes) Summary: FAIL(F) O = OK F = Failure(s), extended report at the bottom X = Failure(s) under TEST but not under harness ? = still running or test results not (yet) available Build failures during: - = unknown or N/A c = Configure, m = make, M = make (after miniperl...

Smoke [5.10.1] maint-5.10-1725-g5b53e9f FAIL(XF) netbsd 5.0 (i386/1 cpu)
Automated smoke report for 5.10.1 patch 5b53e9f3c366c11df59536b294aba43e843db9b0 maint-5.10-1725-g5b53e9f p5netbsd: Intel 686-class (i386/1 cpu) on netbsd - 5.0 using cc version 4.1.3 20080704 prerelease (NetBSD nb2 20081120) smoketime 8 hours 17 minutes (average 1 hour 2 minutes) Summary: FAIL(XF) O = OK F = Failure(s), extended report at the bottom X = Failure(s) under TEST but not under harness ? = still running or test results not (yet) available Build failures during: - = unknown or N/A c = Configure, m = make, M = make (after miniperl), t = mak...

Smoke [5.10.0] maint-5.10-306-gf399cac FAIL(XF) netbsd 4.0.1 (i386/1 cpu)
Automated smoke report for 5.10.0 patch f399cac1256d7e7d3864805b5c7b39e71cf4ccb8 maint-5.10-306-gf399cac p5netbsd: AMD Duron (686-class) (i386/1 cpu) on netbsd - 4.0.1 using cc version 4.1.2 20061021 prerelease (NetBSD nb3 20061125) smoketime 21 hours 46 minutes (average 2 hours 43 minutes) Summary: FAIL(XF) O = OK F = Failure(s), extended report at the bottom X = Failure(s) under TEST but not under harness ? = still running or test results not (yet) available Build failures during: - = unknown or N/A c = Configure, m = make, M = make (after miniperl...

Smoke [5.10.0] maint-5.10-333-g9d20908 FAIL(XF) netbsd 4.0.1 (i386/1 cpu)
Automated smoke report for 5.10.0 patch 9d20908063546f3b632075bec44205d1b6f709b0 maint-5.10-333-g9d20908 p5netbsd: AMD Duron (686-class) (i386/1 cpu) on netbsd - 4.0.1 using cc version 4.1.2 20061021 prerelease (NetBSD nb3 20061125) smoketime 16 hours 20 minutes (average 2 hours 2 minutes) Summary: FAIL(XF) O = OK F = Failure(s), extended report at the bottom X = Failure(s) under TEST but not under harness ? = still running or test results not (yet) available Build failures during: - = unknown or N/A c = Configure, m = make, M = make (after miniperl)...

Smoke [5.10.0] maint-5.10-302-g9408c95 FAIL(XF) netbsd 4.0.1 (i386/1 cpu)
Automated smoke report for 5.10.0 patch 9408c95930c8a02f5895231b594438301b347ade maint-5.10-302-g9408c95 p5netbsd: AMD Duron (686-class) (i386/1 cpu) on netbsd - 4.0.1 using cc version 4.1.2 20061021 prerelease (NetBSD nb3 20061125) smoketime 21 hours 47 minutes (average 2 hours 43 minutes) Summary: FAIL(XF) O = OK F = Failure(s), extended report at the bottom X = Failure(s) under TEST but not under harness ? = still running or test results not (yet) available Build failures during: - = unknown or N/A c = Configure, m = make, M = make (after miniperl...

Smoke [5.10.0] maint-5.10-957-g803123f FAIL(XF) netbsd 4.0.1 (i386/1 cpu)
Automated smoke report for 5.10.0 patch 803123f0d669db74e93858d329fb2e7a6de1ef40 maint-5.10-957-g803123f p5netbsd: AMD Duron (686-class) (i386/1 cpu) on netbsd - 4.0.1 using cc version 4.1.2 20061021 prerelease (NetBSD nb3 20061125) smoketime 1 day 27 minutes (average 3 hours 3 minutes) Summary: FAIL(XF) O = OK F = Failure(s), extended report at the bottom X = Failure(s) under TEST but not under harness ? = still running or test results not (yet) available Build failures during: - = unknown or N/A c = Configure, m = make, M = make (after miniperl), t...

Smoke [5.10.0] maint-5.10-1021-gc83257b FAIL(XF) netbsd 4.0.1 (i386/1 cpu)
Automated smoke report for 5.10.0 patch c83257bcd8d9878d888f0d1f86aa90088946c906 maint-5.10-1021-gc83257b p5netbsd: AMD Duron (686-class) (i386/1 cpu) on netbsd - 4.0.1 using cc version 4.1.2 20061021 prerelease (NetBSD nb3 20061125) smoketime 1 day 31 minutes (average 3 hours 3 minutes) Summary: FAIL(XF) O = OK F = Failure(s), extended report at the bottom X = Failure(s) under TEST but not under harness ? = still running or test results not (yet) available Build failures during: - = unknown or N/A c = Configure, m = make, M = make (after miniperl), ...

Smoke [5.10.0] maint-5.10-186-g8f089f6 FAIL(m) netbsd 4.0.1 (i386/1 cpu)
Automated smoke report for 5.10.0 patch 8f089f6646fb9d8cf7c65d7a9d8a2273000bd9d6 maint-5.10-186-g8f089f6 p5netbsd: AMD Duron (686-class) (i386/1 cpu) on netbsd - 4.0.1 using cc version 4.1.2 20061021 prerelease (NetBSD nb3 20061125) smoketime 19 minutes 18 seconds (average 2 minutes 24.750 seconds) Summary: FAIL(m) O = OK F = Failure(s), extended report at the bottom X = Failure(s) under TEST but not under harness ? = still running or test results not (yet) available Build failures during: - = unknown or N/A c = Configure, m = make, M = make (after m...

Smoke [5.10.0] maint-5.10-188-g6c1c150 FAIL(m) netbsd 4.0.1 (i386/1 cpu)
Automated smoke report for 5.10.0 patch 6c1c150b4ab959ad1fb1f7862dfb1a1caed12071 maint-5.10-188-g6c1c150 p5netbsd: AMD Duron (686-class) (i386/1 cpu) on netbsd - 4.0.1 using cc version 4.1.2 20061021 prerelease (NetBSD nb3 20061125) smoketime 19 minutes 25 seconds (average 2 minutes 25.625 seconds) Summary: FAIL(m) O = OK F = Failure(s), extended report at the bottom X = Failure(s) under TEST but not under harness ? = still running or test results not (yet) available Build failures during: - = unknown or N/A c = Configure, m = make, M = make (after m...

Web resources about - Smoke [5.10.1] perl-5.10.1-RC1-30-ga3929e2 FAIL(F) netbsd 5.0.1 (i386/1 cpu) - perl.perl5.porters

Planned Parenthood Shooter Told Police 'No More Baby Parts'
It certainly appears that Robert Lewis Dear, the man held in custody for terrorizing a Colorado Planned Parenthood clinic, was inspired by David ...

Fox Pundits Blame Black Lives Matter And Unions For Economic Woes
In the wake of the video reveal of Laquan McDonald's execution by a member of the Chicago P.D., BLM protesters marched on Chicago's magnificent ...

Paris climate activists plan human chain on global day of action
CNN International Paris climate activists plan human chain on global day of action Reuters ... * Activists plan "human chain" along route ...

Tutankhamun's tomb is hiding Queen Nefertiti behind the walls reveal radar images
Eygyptologists believe they may have found the final resting place of the lost Queen Nefertiti, the supposed stepmother of boy-king Tutankhaumun ...

Killing of Pro-Kurdish Lawyer Sparks Protest - Al Jazeera America
Tahir Elci, a human rights defender, had faced a criminal charge for speaking in defense of Kurdish rebels

Donald Trump Supporter Accused Of Animal Cruelty Lends Elephant To Campaign Event
From stump to stump, controversy tends to follow GOP candidate Donald Trump. Most recently, hullaballoo manifested in the form of a prettified ...

Ben Carson's Dispatches From Jordan: Syrian Refugees Love It Here
Coming off fresh from an incident in which he compared the Syrian refugees to “rabid dogs,” Ben Carson is now spending the week in Jordan , where ...

Sheriff's deputies rescue newborn found buried near river
Fox News Sheriff's deputies rescue newborn found buried near river Fox News This Friday, Nov. 27, 2015 photo provided by the Los Angeles County ...

Putin, citing national security, signs Turkey sanctions decree
Reuters Putin, citing national security, signs Turkey sanctions decree Reuters MOSCOW President Vladimir Putin signed a decree imposing a ...

Cleveland police shooting of Tamir Rice was unjustified, experts conclude
New York Daily News Cleveland police shooting of Tamir Rice was unjustified, experts conclude New York Daily News Two independent experts ...

Resources last updated: 11/29/2015 5:51:14 AM