Smoke [5.10.1] perl-5.10.1-RC1-1-gbadf489 FAIL(F) netbsd 5.0.1 (i386/1 cpu)

Automated smoke report for 5.10.1 patch badf48949ef0f6be41c06a682330f4aa37c4f4ff perl-5.10.1-RC1-1-gbadf489
p5netbsd: Intel 686-class (i386/1 cpu)
    on        netbsd - 5.0.1
    using     cc version 4.1.3 20080704 prerelease (NetBSD nb2 20081120)
    smoketime 9 hours 14 minutes (average 1 hour 9 minutes)

Summary: FAIL(F)

O = OK  F = Failure(s), extended report at the bottom
X = Failure(s) under TEST but not under harness
? = still running or test results not (yet) available
Build failures during:       - = unknown or N/A
c = Configure, m = make, M = make (after miniperl), t = make test-prep

perl-5.10.1-RC1-1-gbadf489  Configuration (common) none
----------- ---------------------------------------------------------
O O O O     
O O O O     -Duse64bitint
O O F F     -Duseithreads
F F F F     -Duseithreads -Duse64bitint
| | | +----- PERLIO = perlio -DDEBUGGING
| | +------- PERLIO = stdio  -DDEBUGGING
| +--------- PERLIO = perlio
+----------- PERLIO = stdio


Locally applied patches:
    SMOKEbadf48949ef0f6be41c06a682330f4aa37c4f4ff

Failures: (common-args) none
[stdio] -DDEBUGGING -Duseithreads
    ../lib/CPANPLUS/t/04_CPANPLUS-Module.t......................FAILED
        109
    ../lib/Archive/Extract/t/01_Archive-Extract.t...............FAILED
        35, 37-42, 61-66, 107, 109-110, 112-114
        131, 133-138, 157-162, 191, 193-198, 217-222
        239, 241-246, 265-270, 287, 289-294, 313-318
        347, 349-354, 373-378, 395, 397-398, 400-402
        419, 421-426, 445-450, 467, 469-470, 472-474
        527, 529-534, 553-558
    ../lib/CPANPLUS/Dist/Build/t/02_CPANPLUS-Dist-Build.t.......FAILED
        11-16, 20, 23, 26-31, 37
    ../lib/IPC/Cmd/t/01_IPC-Cmd.t...............................FAILED
        17-18, 23-24, 26-29, 34-35, 37-40, 45-46
        48-51, 56-57, 59-62, 67-68, 70-73, 78-79
        81-84, 89-90, 92-95, 100-101, 103-106, 111-112
        114-117, 122-123, 125-128, 133-134, 136-139
        144-145, 147-150, 155-156, 158-161, 166-167
        169-172, 177-178, 180-183, 188-189, 191-194
        199-200, 202-205, 210-211, 213-216, 221-222
        224-227, 232-233
    ../t/io/dup.t...............................................FAILED
        15-16
    ../t/io/open.t..............................................FAILED
        93
    ../lib/CPANPLUS/t/20_CPANPLUS-Dist-MM.t.....................FAILED
        11-12, 14, 17-18, 41-43
    ../lib/CPANPLUS/t/19_CPANPLUS-Dist.t........................FAILED
        62-63, 68-70

[perlio] -DDEBUGGING -Duseithreads
    ../lib/CPANPLUS/t/04_CPANPLUS-Module.t......................FAILED
        109
    ../lib/CPANPLUS/Dist/Build/t/02_CPANPLUS-Dist-Build.t.......FAILED
        11-16, 20, 23, 26-31, 37
    ../lib/CPANPLUS/t/19_CPANPLUS-Dist.t........................FAILED
        31
    ../lib/Archive/Extract/t/01_Archive-Extract.t...............FAILED
        35, 37-42, 61-66, 107, 109-110, 112-114
        131, 133-138, 157-162, 191, 193-198, 217-222
        239, 241-246, 265-270, 287, 289-294, 313-318
        347, 349-354, 373-378, 395, 397-398, 400-402
        419, 421-426, 445-450, 467, 469-470, 472-474
        527, 529-534, 553-558
    ../t/io/dup.t...............................................FAILED
        15-16
    ../t/io/open.t..............................................FAILED
        93
    ../lib/CPANPLUS/t/20_CPANPLUS-Dist-MM.t.....................FAILED
        11-12, 14, 17-18, 42
    ../lib/IPC/Cmd/t/01_IPC-Cmd.t...............................FAILED
        17-18, 23-24, 26-29, 34-35, 37-40, 45-46
        48-51, 56-57, 59-62, 67-68, 70-73, 78-79
        81-84, 89-90, 92-95, 100-101, 103-106, 111-112
        114-117, 122-123, 125-128, 133-134, 136-139
        144-145, 147-150, 155-156, 158-161, 166-167
        169-172, 177-178, 180-183, 188-189, 191-194
        199-200, 202-205, 210-211, 213-216, 221-222
        224-227, 232-233

[stdio] -Duseithreads -Duse64bitint
    ../lib/CPANPLUS/t/04_CPANPLUS-Module.t......................FAILED
        109
    ../lib/CPANPLUS/Dist/Build/t/02_CPANPLUS-Dist-Build.t.......FAILED
        11-16, 20, 23, 26-31, 37
    ../lib/Archive/Extract/t/01_Archive-Extract.t...............FAILED
        35, 37-42, 61-66, 107, 109-110, 112-114
        131, 133-138, 157-162, 191, 193-198, 217-222
        239, 241-246, 265-270, 287, 289-294, 313-318
        347, 349-354, 373-378, 395, 397-398, 400-402
        419, 421-426, 445-450, 467, 469-470, 472-474
        527, 529-534, 553-558
    ../lib/IPC/Cmd/t/01_IPC-Cmd.t...............................FAILED
        17-18, 23-24, 26-29, 34-35, 37-40, 45-46
        48-51, 56-57, 59-62, 67-68, 70-73, 78-79
        81-84, 89-90, 92-95, 100-101, 103-106, 111-112
        114-117, 122-123, 125-128, 133-134, 136-139
        144-145, 147-150, 155-156, 158-161, 166-167
        169-172, 177-178, 180-183, 188-189, 191-194
        199-200, 202-205, 210-211, 213-216, 221-222
        224-227, 232-233
    ../t/io/dup.t...............................................FAILED
        15-16
    ../t/io/open.t..............................................FAILED
        93
    ../lib/CPANPLUS/t/20_CPANPLUS-Dist-MM.t.....................FAILED
        11-12, 14, 17-18, 42
    ../lib/CPANPLUS/t/19_CPANPLUS-Dist.t........................FAILED
        62-63, 72

[perlio] -Duseithreads -Duse64bitint
    ../lib/CPANPLUS/t/04_CPANPLUS-Module.t......................FAILED
        109
    ../lib/CPANPLUS/Dist/Build/t/02_CPANPLUS-Dist-Build.t.......FAILED
        11-16, 20, 23, 26-31, 37
    ../lib/Archive/Extract/t/01_Archive-Extract.t...............FAILED
        35, 37-42, 61-66, 107, 109-110, 112-114
        131, 133-138, 157-162, 191, 193-198, 217-222
        239, 241-246, 265-270, 287, 289-294, 313-318
        347, 349-354, 373-378, 395, 397-398, 400-402
        419, 421-426, 445-450, 467, 469-470, 472-474
        527, 529-534, 553-558
    ../lib/CPANPLUS/t/20_CPANPLUS-Dist-MM.t.....................FAILED
        11-12, 14, 17-18, 42
    ../t/io/dup.t...............................................FAILED
        15-16
    ../t/io/open.t..............................................FAILED
        93
    ../lib/IPC/Cmd/t/01_IPC-Cmd.t...............................FAILED
        17-18, 23-24, 26-29, 34-35, 37-40, 45-46
        48-51, 56-57, 59-62, 67-68, 70-73, 78-79
        81-84, 89-90, 92-95, 100-101, 103-106, 111-112
        114-117, 122-123, 125-128, 133-134, 136-139
        144-145, 147-150, 155-156, 158-161, 166-167
        169-172, 177-178, 180-183, 188-189, 191-194
        199-200, 202-205, 210-211, 213-216, 221-222
        224-227, 232-233
    ../lib/CPANPLUS/t/19_CPANPLUS-Dist.t........................FAILED
        62-63

[stdio] -DDEBUGGING -Duseithreads -Duse64bitint
    ../lib/CPANPLUS/t/04_CPANPLUS-Module.t......................FAILED
        109
    ../lib/CPANPLUS/Dist/Build/t/02_CPANPLUS-Dist-Build.t.......FAILED
        11-16, 20, 23, 26-31, 37
    ../lib/Archive/Extract/t/01_Archive-Extract.t...............FAILED
        35, 37-42, 61-66, 107, 109-110, 112-114
        131, 133-138, 157-162, 191, 193-198, 217-222
        239, 241-246, 265-270, 287, 289-294, 313-318
        347, 349-354, 373-378, 395, 397-398, 400-402
        419, 421-426, 445-450, 467, 469-470, 472-474
        527, 529-534, 553-558
    ../lib/CPANPLUS/t/20_CPANPLUS-Dist-MM.t.....................FAILED
        7-9
    ../t/io/dup.t...............................................FAILED
        15-16
    ../t/io/open.t..............................................FAILED
        93
    ../lib/IPC/Cmd/t/01_IPC-Cmd.t...............................FAILED
        17-18, 23-24, 26-29, 34-35, 37-40, 45-46
        48-51, 56-57, 59-62, 67-68, 70-73, 78-79
        81-84, 89-90, 92-95, 100-101, 103-106, 111-112
        114-117, 122-123, 125-128, 133-134, 136-139
        144-145, 147-150, 155-156, 158-161, 166-167
        169-172, 177-178, 180-183, 188-189, 191-194
        199-200, 202-205, 210-211, 213-216, 221-222
        224-227, 232-233
    ../lib/CPANPLUS/t/19_CPANPLUS-Dist.t........................FAILED
        33, 62-63

[perlio] -DDEBUGGING -Duseithreads -Duse64bitint
    ../lib/CPANPLUS/t/04_CPANPLUS-Module.t......................FAILED
        109
    ../lib/CPANPLUS/Dist/Build/t/02_CPANPLUS-Dist-Build.t.......FAILED
        11-16, 20, 23, 26-31, 37
    ../lib/Archive/Extract/t/01_Archive-Extract.t...............FAILED
        35, 37-42, 61-66, 107, 109-110, 112-114
        131, 133-138, 157-162, 191, 193-198, 217-222
        239, 241-246, 265-270, 287, 289-294, 313-318
        347, 349-354, 373-378, 395, 397-398, 400-402
        419, 421-426, 445-450, 467, 469-470, 472-474
        527, 529-534, 553-558
    ../lib/CPANPLUS/t/20_CPANPLUS-Dist-MM.t.....................FAILED
        11-12, 14, 17-18, 42
    ../lib/CPANPLUS/t/19_CPANPLUS-Dist.t........................FAILED
        55
    ../t/io/dup.t...............................................FAILED
        15-16
    ../lib/IPC/Cmd/t/01_IPC-Cmd.t...............................FAILED
        17-18, 23-24, 26-29, 34-35, 37-40, 45-46
        48-51, 56-57, 59-62, 67-68, 70-73, 78-79
        81-84, 89-90, 92-95, 100-101, 103-106, 111-112
        114-117, 122-123, 125-128, 133-134, 136-139
        144-145, 147-150, 155-156, 158-161, 166-167
        169-172, 177-178, 180-183, 188-189, 191-194
        199-200, 202-205, 210-211, 213-216, 221-222
        224-227, 232-233
    ../t/io/open.t..............................................FAILED
        93

Compiler messages(gcc):
perlio.c: In function 'PerlIOStdio_set_ptrcnt':
perlio.c:3450: warning: pointer targets in assignment differ in signedness
Peek.c: In function 'XS_Devel__Peek_mstat':
Peek.c:391: warning: passing argument 1 of 'Perl_dump_mstats' discards qualifiers from pointer target type
<command line>:1:1: warning: "TIME_HIRES_STAT" redefined
<command line>:1:1: warning: this is the location of the previous definition
/usr/include/sys/cdefs_elf.h:67:20: error: missing binary operator before token "("
Peek.c:391: warning: passing argument 2 of 'Perl_dump_mstats' discards qualifiers from pointer target type

-- 
Report by Test::Smoke v1.39 build 1235 running on perl 5.10.0
(Reporter v0.035 / Smoker v0.044)
0
stsc
8/7/2009 3:13:27 AM
perl.perl5.porters 48287 articles. 1 followers. Follow

0 Replies
1088 Views

Similar Articles

[PageSpeed] 10

Reply:

Similar Artilces:

Smoke [5.10.0] maint-5.10-328-gbcd41b7 FAIL(F) netbsd 4.0.1 (i386/1 cpu)
Automated smoke report for 5.10.0 patch bcd41b7997abaa21e066e80f23cd72857f8f5f56 maint-5.10-328-gbcd41b7 p5netbsd: AMD Duron (686-class) (i386/1 cpu) on netbsd - 4.0.1 using cc version 4.1.2 20061021 prerelease (NetBSD nb3 20061125) smoketime 14 hours 12 minutes (average 1 hour 46 minutes) Summary: FAIL(F) O = OK F = Failure(s), extended report at the bottom X = Failure(s) under TEST but not under harness ? = still running or test results not (yet) available Build failures during: - = unknown or N/A c = Configure, m = make, M = make (after miniperl),...

Smoke [5.10.0] maint-5.10-346-gb941d8b FAIL(F) netbsd 4.0.1 (i386/1 cpu)
Automated smoke report for 5.10.0 patch b941d8bbf1cec8924975fbd33e853485c15eb066 maint-5.10-346-gb941d8b p5netbsd: AMD Duron (686-class) (i386/1 cpu) on netbsd - 4.0.1 using cc version 4.1.2 20061021 prerelease (NetBSD nb3 20061125) smoketime 22 hours 40 minutes (average 2 hours 50 minutes) Summary: FAIL(F) O = OK F = Failure(s), extended report at the bottom X = Failure(s) under TEST but not under harness ? = still running or test results not (yet) available Build failures during: - = unknown or N/A c = Configure, m = make, M = make (after miniperl)...

Smoke [5.10.0] maint-5.10-299-g1625989 FAIL(F) netbsd 4.0.1 (i386/1 cpu)
Automated smoke report for 5.10.0 patch 16259899a80a8de3fd74bd26a6308681f03dac63 maint-5.10-299-g1625989 p5netbsd: AMD Duron (686-class) (i386/1 cpu) on netbsd - 4.0.1 using cc version 4.1.2 20061021 prerelease (NetBSD nb3 20061125) smoketime 21 hours 43 minutes (average 2 hours 42 minutes) Summary: FAIL(F) O = OK F = Failure(s), extended report at the bottom X = Failure(s) under TEST but not under harness ? = still running or test results not (yet) available Build failures during: - = unknown or N/A c = Configure, m = make, M = make (after miniperl)...

Smoke [5.10.0] maint-5.10-459-g6a49472 FAIL(F) netbsd 4.0.1 (i386/1 cpu)
Automated smoke report for 5.10.0 patch 6a4947285303421b2ef88204489fbfd215e26389 maint-5.10-459-g6a49472 p5netbsd: AMD Duron (686-class) (i386/1 cpu) on netbsd - 4.0.1 using cc version 4.1.2 20061021 prerelease (NetBSD nb3 20061125) smoketime 21 hours 53 minutes (average 2 hours 44 minutes) Summary: FAIL(F) O = OK F = Failure(s), extended report at the bottom X = Failure(s) under TEST but not under harness ? = still running or test results not (yet) available Build failures during: - = unknown or N/A c = Configure, m = make, M = make (after miniperl)...

Smoke [5.10.0] maint-5.10-598-g331b76d FAIL(F) netbsd 4.0.1 (i386/1 cpu)
Automated smoke report for 5.10.0 patch 331b76decc59416d8320ad49a4fba9fed874a177 maint-5.10-598-g331b76d p5netbsd: AMD Duron (686-class) (i386/1 cpu) on netbsd - 4.0.1 using cc version 4.1.2 20061021 prerelease (NetBSD nb3 20061125) smoketime 16 hours 44 minutes (average 2 hours 5 minutes) Summary: FAIL(F) O = OK F = Failure(s), extended report at the bottom X = Failure(s) under TEST but not under harness ? = still running or test results not (yet) available Build failures during: - = unknown or N/A c = Configure, m = make, M = make (after miniperl),...

Smoke [5.10.0] maint-5.10-1079-ga9d5891 FAIL(F) netbsd 4.0.1 (i386/1 cpu)
Automated smoke report for 5.10.0 patch a9d58912b709187ad8c9e439b72b3a14130d36d8 maint-5.10-1079-ga9d5891 p5netbsd: AMD Duron (686-class) (i386/1 cpu) on netbsd - 4.0.1 using cc version 4.1.2 20061021 prerelease (NetBSD nb3 20061125) smoketime 18 hours 22 minutes (average 2 hours 17 minutes) Summary: FAIL(F) O = OK F = Failure(s), extended report at the bottom X = Failure(s) under TEST but not under harness ? = still running or test results not (yet) available Build failures during: - = unknown or N/A c = Configure, m = make, M = make (after miniperl...

Smoke [5.10.0] maint-5.10-381-g136f962 FAIL(F) netbsd 4.0.1 (i386/1 cpu)
Automated smoke report for 5.10.0 patch 136f96283a398f49aa36b7d47086bf37fd04c4b4 maint-5.10-381-g136f962 p5netbsd: AMD Duron (686-class) (i386/1 cpu) on netbsd - 4.0.1 using cc version 4.1.2 20061021 prerelease (NetBSD nb3 20061125) smoketime 22 hours 37 minutes (average 2 hours 49 minutes) Summary: FAIL(F) O = OK F = Failure(s), extended report at the bottom X = Failure(s) under TEST but not under harness ? = still running or test results not (yet) available Build failures during: - = unknown or N/A c = Configure, m = make, M = make (after miniperl)...

Smoke [5.10.1] maint-5.10-1725-g5b53e9f FAIL(XF) netbsd 5.0 (i386/1 cpu)
Automated smoke report for 5.10.1 patch 5b53e9f3c366c11df59536b294aba43e843db9b0 maint-5.10-1725-g5b53e9f p5netbsd: Intel 686-class (i386/1 cpu) on netbsd - 5.0 using cc version 4.1.3 20080704 prerelease (NetBSD nb2 20081120) smoketime 8 hours 17 minutes (average 1 hour 2 minutes) Summary: FAIL(XF) O = OK F = Failure(s), extended report at the bottom X = Failure(s) under TEST but not under harness ? = still running or test results not (yet) available Build failures during: - = unknown or N/A c = Configure, m = make, M = make (after miniperl), t = mak...

Smoke [5.11.1] v5.11.1-167-g437d421 FAIL(F) netbsd 5.0.1 (i386/1 cpu)
Automated smoke report for 5.11.1 patch 437d4214522421889ca7657c5c9e7dc2f6d1ef7b v5.11.1-167-g437d421 p5netbsd: Intel 686-class (i386/1 cpu) on netbsd - 5.0.1 using cc version 4.1.3 20080704 prerelease (NetBSD nb2 20081120) smoketime 6 hours 43 minutes (average 50 minutes 25 seconds) Summary: FAIL(F) O = OK F = Failure(s), extended report at the bottom X = Failure(s) under TEST but not under harness ? = still running or test results not (yet) available Build failures during: - = unknown or N/A c = Configure, m = make, M = make (after miniperl), t = m...

Smoke [5.11.1] v5.11.1-205-ga1248f1 FAIL(F) netbsd 5.0.1 (i386/1 cpu)
Automated smoke report for 5.11.1 patch a1248f17ffcfa8fe0e91df962317b46b81fc0ce5 v5.11.1-205-ga1248f1 p5netbsd: Intel 686-class (i386/1 cpu) on netbsd - 5.0.1 using cc version 4.1.3 20080704 prerelease (NetBSD nb2 20081120) smoketime 6 hours 36 minutes (average 49 minutes 32 seconds) Summary: FAIL(F) O = OK F = Failure(s), extended report at the bottom X = Failure(s) under TEST but not under harness ? = still running or test results not (yet) available Build failures during: - = unknown or N/A c = Configure, m = make, M = make (after miniperl), t = m...

Smoke [5.10.0] maint-5.10-302-g9408c95 FAIL(XF) netbsd 4.0.1 (i386/1 cpu)
Automated smoke report for 5.10.0 patch 9408c95930c8a02f5895231b594438301b347ade maint-5.10-302-g9408c95 p5netbsd: AMD Duron (686-class) (i386/1 cpu) on netbsd - 4.0.1 using cc version 4.1.2 20061021 prerelease (NetBSD nb3 20061125) smoketime 21 hours 47 minutes (average 2 hours 43 minutes) Summary: FAIL(XF) O = OK F = Failure(s), extended report at the bottom X = Failure(s) under TEST but not under harness ? = still running or test results not (yet) available Build failures during: - = unknown or N/A c = Configure, m = make, M = make (after miniperl...

Smoke [5.10.0] maint-5.10-306-gf399cac FAIL(XF) netbsd 4.0.1 (i386/1 cpu)
Automated smoke report for 5.10.0 patch f399cac1256d7e7d3864805b5c7b39e71cf4ccb8 maint-5.10-306-gf399cac p5netbsd: AMD Duron (686-class) (i386/1 cpu) on netbsd - 4.0.1 using cc version 4.1.2 20061021 prerelease (NetBSD nb3 20061125) smoketime 21 hours 46 minutes (average 2 hours 43 minutes) Summary: FAIL(XF) O = OK F = Failure(s), extended report at the bottom X = Failure(s) under TEST but not under harness ? = still running or test results not (yet) available Build failures during: - = unknown or N/A c = Configure, m = make, M = make (after miniperl...

Smoke [5.10.0] maint-5.10-186-g8f089f6 FAIL(m) netbsd 4.0.1 (i386/1 cpu)
Automated smoke report for 5.10.0 patch 8f089f6646fb9d8cf7c65d7a9d8a2273000bd9d6 maint-5.10-186-g8f089f6 p5netbsd: AMD Duron (686-class) (i386/1 cpu) on netbsd - 4.0.1 using cc version 4.1.2 20061021 prerelease (NetBSD nb3 20061125) smoketime 19 minutes 18 seconds (average 2 minutes 24.750 seconds) Summary: FAIL(m) O = OK F = Failure(s), extended report at the bottom X = Failure(s) under TEST but not under harness ? = still running or test results not (yet) available Build failures during: - = unknown or N/A c = Configure, m = make, M = make (after m...

Smoke [5.10.0] maint-5.10-188-g6c1c150 FAIL(m) netbsd 4.0.1 (i386/1 cpu)
Automated smoke report for 5.10.0 patch 6c1c150b4ab959ad1fb1f7862dfb1a1caed12071 maint-5.10-188-g6c1c150 p5netbsd: AMD Duron (686-class) (i386/1 cpu) on netbsd - 4.0.1 using cc version 4.1.2 20061021 prerelease (NetBSD nb3 20061125) smoketime 19 minutes 25 seconds (average 2 minutes 25.625 seconds) Summary: FAIL(m) O = OK F = Failure(s), extended report at the bottom X = Failure(s) under TEST but not under harness ? = still running or test results not (yet) available Build failures during: - = unknown or N/A c = Configure, m = make, M = make (after m...

Smoke [5.10.0] maint-5.10-333-g9d20908 FAIL(XF) netbsd 4.0.1 (i386/1 cpu)
Automated smoke report for 5.10.0 patch 9d20908063546f3b632075bec44205d1b6f709b0 maint-5.10-333-g9d20908 p5netbsd: AMD Duron (686-class) (i386/1 cpu) on netbsd - 4.0.1 using cc version 4.1.2 20061021 prerelease (NetBSD nb3 20061125) smoketime 16 hours 20 minutes (average 2 hours 2 minutes) Summary: FAIL(XF) O = OK F = Failure(s), extended report at the bottom X = Failure(s) under TEST but not under harness ? = still running or test results not (yet) available Build failures during: - = unknown or N/A c = Configure, m = make, M = make (after miniperl)...

Web resources about - Smoke [5.10.1] perl-5.10.1-RC1-1-gbadf489 FAIL(F) netbsd 5.0.1 (i386/1 cpu) - perl.perl5.porters

Harry Reid Blames Colorado Shooting on YouTube Videos
Can Hillary be far behind? “We in the Senate should not fail to see the context in which this vile assault took place,” he added, pointing to ...

Obama says parts of climate deal must be legally binding
Parts of a global climate agreement being hammered out in Paris should be legally binding, President Barack Obama said Tuesday. The declaration ...

OnePlus sells iPhone cases with a dash of snark
Wait a second, you might be saying, isn't OnePlus the company that sells that one Android phone? Yes, yes they are that one company. But now ...

Carrie Underwood Premieres Dreamy 'Heartbeat' Video
Carrie Underwood just premiered the music video for her brand new hit “Heartbeat” on Yahoo Music ! “…and here it is, the new music video for ...

‘Star Wars: The Force Awakens’ Will Feature Music From ‘Hamilton’ Mastermind Lin-Manuel Miranda
Fans of space operas and historical musicals rejoice! Just when you thought Star Wars: The Force Awakens had achieved mass cultural saturation, ...


Apple Honors World AIDS Day for the Fifth Year With Red Store Logos
Continuing a tradition begun four years ago , Apple today has joined in recognizing World AIDS Day by coloring Apple logos on its retail stores ...

Two PS4 Bundles Just $299.99 Each Starting December 6th
The holidays are right around the corner and I’m sure many of you are planning on finishing up your holiday shopping soon. If PlayStation 4 is ...

Google to end support for Chrome on 32-bit Linux, Ubuntu Precise, and Debian 7 in early March 2016
Brian Fagioli / BetaNews : Google to end support for Chrome on 32-bit Linux, Ubuntu Precise, and Debian 7 in early March 2016 — Google killing ...

Toymaker VTech leaves thousands of photos of children and chat logs vulnerable to hacking
A hacker who infiltrated toymaker VTech's systems easily accessed thousands of pictures of children and chat logs between them and their parents ...

Resources last updated: 12/1/2015 4:11:01 PM