Smoke [5.10.1] perl-5.10.1-1-gca8de22 FAIL(F) linux 2.6.38-2-amd64 [debian] (x86_64/2 cpu)

Automated smoke report for 5.10.1 patch ca8de220718ba91d5a5fdd9779497cd5b0250258 perl-5.10.1-1-gca8de22
bandsman.dyndns-ip.com: AMD Athlon(tm) Dual Core Processor 4450e (AuthenticAMD 2300MHz) (x86_64/2 cpu)
    on        linux - 2.6.38-2-amd64 [debian]
    using     cc version 4.5.2
    smoketime 4 hours 28 minutes (average 16 minutes 46 seconds)

Summary: FAIL(F)

O = OK  F = Failure(s), extended report at the bottom
X = Failure(s) under TEST but not under harness
? = still running or test results not (yet) available
Build failures during:       - = unknown or N/A
c = Configure, m = make, M = make (after miniperl), t = make test-prep

perl-5.10.1-1-gca8de22  Configuration (common) none
----------- ---------------------------------------------------------
O O         
O O         -Duse64bitint
F F         -Duselongdouble
F F         -Dusemorebits
O O         -Duseithreads
O O         -Duseithreads -Duse64bitint
F F         -Duseithreads -Duselongdouble
F F         -Duseithreads -Dusemorebits
| +--------- -DDEBUGGING
+----------- no debugging


Locally applied patches:
    SMOKEca8de220718ba91d5a5fdd9779497cd5b0250258

Failures: (common-args) none
[default] -Duselongdouble
[default] -Dusemorebits
    ../t/op/pack.t..............................................FAILED
        3934, 3936, 3939, 3941, 3944, 3946, 3949
        3951, 3954, 3956, 3984, 3986, 3989, 3991
        3994, 3996, 3999, 4001, 4004, 4006, 4310
        4320, 13566, 13568, 13570, 13572, 13574
        13577, 13580, 13583, 13586, 13589, 13592
        13595, 13598, 13601, 13604, 13607, 13610
        13613, 13616, 13619, 13732, 13734, 13736
        13738, 13740, 13743, 13746, 13749, 13752
        13755, 13758, 13761, 13764, 13767, 13770
        13773, 13776, 13779, 13782, 13785, 14374
        14380, 14383, 14389

[default] -DDEBUGGING -Duselongdouble
[default] -DDEBUGGING -Dusemorebits
    ../t/op/pack.t..............................................FAILED
        3934, 3939, 3944, 3949, 3954, 3984, 3989
        3994, 3999, 4004, 13568, 13572, 13580, 13586
        13589, 13592, 13595, 13598, 13601, 13604
        13607, 13610, 13613, 13616, 13619, 13734
        13738, 13746, 13749, 13752, 13755, 13758
        13761, 13764, 13770, 13773, 13776, 13779
        13782, 13785, 14374, 14380, 14383, 14389

[default] -Duseithreads -Duselongdouble
[default] -Duseithreads -Dusemorebits
    ../t/op/pack.t..............................................FAILED
        3934, 3936, 3939, 3944, 3949, 3954, 3984
        3989, 3994, 3999, 4004, 14374, 14380, 14383
        14389

[default] -DDEBUGGING -Duseithreads -Duselongdouble
[default] -DDEBUGGING -Duseithreads -Dusemorebits
    ../t/op/pack.t..............................................FAILED
        3934, 3939, 3944, 3949, 3954, 3984, 3989
        3994, 3999, 4004, 14374, 14380, 14383, 14389

Compiler messages(gcc):
try.c: In function ‘main’:
try.c:4021:17: warning: extra tokens at end of #ifdef directive
try.c:4024:18: warning: extra tokens at end of #ifdef directive
try.c:4027:19: warning: extra tokens at end of #ifdef directive
try.c:4030:19: warning: extra tokens at end of #ifdef directive
try.c:4057:17: warning: extra tokens at end of #ifdef directive
try.c:4060:18: warning: extra tokens at end of #ifdef directive
try.c:4063:19: warning: extra tokens at end of #ifdef directive
try.c:4066:19: warning: extra tokens at end of #ifdef directive
try.c:4117:17: warning: extra tokens at end of #ifdef directive
try.c:4120:18: warning: extra tokens at end of #ifdef directive
try.c:4123:19: warning: extra tokens at end of #ifdef directive
try.c:4126:19: warning: extra tokens at end of #ifdef directive
try.c:4153:16: warning: extra tokens at end of #ifdef directive
try.c:4156:17: warning: extra tokens at end of #ifdef directive
try.c:4159:18: warning: extra tokens at end of #ifdef directive
try.c:4162:18: warning: extra tokens at end of #ifdef directive
try.c:4417:18: warning: extra tokens at end of #ifdef directive
try.c:4420:19: warning: extra tokens at end of #ifdef directive
try.c:4423:20: warning: extra tokens at end of #ifdef directive
try.c:4426:20: warning: extra tokens at end of #ifdef directive
try.c:10153:18: warning: extra tokens at end of #ifdef directive
try.c:10156:19: warning: extra tokens at end of #ifdef directive
try.c:10159:20: warning: extra tokens at end of #ifdef directive
try.c:10162:20: warning: extra tokens at end of #ifdef directive
try.c:10189:18: warning: extra tokens at end of #ifdef directive
try.c:10192:19: warning: extra tokens at end of #ifdef directive
try.c:10195:20: warning: extra tokens at end of #ifdef directive
try.c:10198:20: warning: extra tokens at end of #ifdef directive
try.c:10225:18: warning: extra tokens at end of #ifdef directive
try.c:10228:19: warning: extra tokens at end of #ifdef directive
try.c:10231:20: warning: extra tokens at end of #ifdef directive
try.c:10234:20: warning: extra tokens at end of #ifdef directive
try.c:10261:17: warning: extra tokens at end of #ifdef directive
try.c:10264:18: warning: extra tokens at end of #ifdef directive
try.c:10267:19: warning: extra tokens at end of #ifdef directive
try.c:10270:19: warning: extra tokens at end of #ifdef directive
try.c:10489:19: warning: extra tokens at end of #ifdef directive
try.c:10492:20: warning: extra tokens at end of #ifdef directive
try.c:10495:21: warning: extra tokens at end of #ifdef directive
try.c:10498:21: warning: extra tokens at end of #ifdef directive
pp.c: In function ‘Perl_pp_not’:
pp.c:2473:31: warning: identifier "not" is a special operator name in C++
pp.c: In function ‘Perl_pp_complement’:
pp.c:2480:37: warning: identifier "compl" is a special operator name in C++
pp_sys.c: In function ‘Perl_pp_getpriority’:
pp_sys.c:4332:5: warning: enum conversion when passing argument 1 of ‘getpriority’ is invalid in C++
pp_sys.c: In function ‘Perl_pp_setpriority’:
pp_sys.c:4347:5: warning: enum conversion when passing argument 1 of ‘setpriority’ is invalid in C++
perlio.c: In function ‘PerlIOBuf_get_base’:
perlio.c:4126:9: warning: operation on ‘b->buf’ may be undefined
/usr/bin/ld: POSIX.o: in function XS_POSIX_tmpnam:POSIX.xs:1547: warning: the use of `tmpnam' is dangerous, better use `mkstemp'

-- 
Report by Test::Smoke v1.44 build 1285 running on perl 5.10.1
(Reporter v0.035 / Smoker v0.045)
0
njh
4/15/2011 11:42:33 AM
perl.perl5.porters 48287 articles. 1 followers. Follow

0 Replies
1007 Views

Similar Articles

[PageSpeed] 29
Get it on Google Play
Get it on Apple App Store

Reply:

Similar Artilces:

Smoke [5.15.1] v5.15.1-38-g606d51b FAIL(F) linux 2.6.39-2-amd64 [debian] (x86_64/2 cpu)
Automated smoke report for 5.15.1 patch 606d51b7e00905cb4fd0fed6ee20d666006f4f1a v5.15.1-38-g606d51b bandsman.dyndns-ip.com: AMD Athlon(tm) Dual Core Processor 4450e (AuthenticAMD 2200MHz) (x86_64/2 cpu) on linux - 2.6.39-2-amd64 [debian] using cc version 4.6.1 smoketime 46 minutes 46 seconds (average 46 minutes 46 seconds) Summary: FAIL(F) O = OK F = Failure(s), extended report at the bottom X = Failure(s) under TEST but not under harness ? = still running or test results not (yet) available Build failures during: - = unknown or N/A c = Configure, m...

Smoke [5.15.1] v5.15.1-7-gd08226e FAIL(F) linux 2.6.39-2-amd64 [debian] (x86_64/2 cpu)
Automated smoke report for 5.15.1 patch d08226e4eb246fd9184617a534f460a6d90a4d21 v5.15.1-7-gd08226e bandsman.dyndns-ip.com: AMD Athlon(tm) Dual Core Processor 4450e (AuthenticAMD 2300MHz) (x86_64/2 cpu) on linux - 2.6.39-2-amd64 [debian] using cc version 4.6.1 smoketime 1 hour 35 minutes (average 1 hour 35 minutes) Summary: FAIL(F) O = OK F = Failure(s), extended report at the bottom X = Failure(s) under TEST but not under harness ? = still running or test results not (yet) available Build failures during: - = unknown or N/A c = Configure, m = make, ...

Smoke [5.15.1] v5.15.1-63-gdb147d7 FAIL(F) linux 2.6.39-2-amd64 [debian] (x86_64/2 cpu)
Automated smoke report for 5.15.1 patch db147d7ee1c1aca547b1d63ef7141e56821a3ae2 v5.15.1-63-gdb147d7 bandsman.dyndns-ip.com: AMD Athlon(tm) Dual Core Processor 4450e (AuthenticAMD 2300MHz) (x86_64/2 cpu) on linux - 2.6.39-2-amd64 [debian] using cc version 4.6.1 smoketime 44 minutes 24 seconds (average 44 minutes 24 seconds) Summary: FAIL(F) O = OK F = Failure(s), extended report at the bottom X = Failure(s) under TEST but not under harness ? = still running or test results not (yet) available Build failures during: - = unknown or N/A c = Configure, m...

Smoke [5.15.1] v5.15.1-57-g69f26f5 FAIL(F) linux 2.6.39-2-amd64 [debian] (x86_64/2 cpu)
Automated smoke report for 5.15.1 patch 69f26f522d3144d15f7bf1df76cb51db6af43d05 v5.15.1-57-g69f26f5 bandsman.dyndns-ip.com: AMD Athlon(tm) Dual Core Processor 4450e (AuthenticAMD 2000MHz) (x86_64/2 cpu) on linux - 2.6.39-2-amd64 [debian] using cc version 4.6.1 smoketime 45 minutes 12 seconds (average 45 minutes 12 seconds) Summary: FAIL(F) O = OK F = Failure(s), extended report at the bottom X = Failure(s) under TEST but not under harness ? = still running or test results not (yet) available Build failures during: - = unknown or N/A c = Configure, m...

Smoke [5.15.1] v5.15.1-51-g6027ee4 FAIL(F) linux 2.6.39-2-amd64 [debian] (x86_64/2 cpu)
Automated smoke report for 5.15.1 patch 6027ee478b8d28c43e93e742f6cce6ac6da97a4d v5.15.1-51-g6027ee4 bandsman.dyndns-ip.com: AMD Athlon(tm) Dual Core Processor 4450e (AuthenticAMD 2300MHz) (x86_64/2 cpu) on linux - 2.6.39-2-amd64 [debian] using cc version 4.6.1 smoketime 44 minutes 42 seconds (average 44 minutes 42 seconds) Summary: FAIL(F) O = OK F = Failure(s), extended report at the bottom X = Failure(s) under TEST but not under harness ? = still running or test results not (yet) available Build failures during: - = unknown or N/A c = Configure, m...

Smoke [5.15.1] v5.15.1-32-g862b2c4 FAIL(F) linux 2.6.39-2-amd64 [debian] (x86_64/2 cpu)
Automated smoke report for 5.15.1 patch 862b2c434beb1d61a19037a8449c8db953fd37a0 v5.15.1-32-g862b2c4 bandsman.dyndns-ip.com: AMD Athlon(tm) Dual Core Processor 4450e (AuthenticAMD 2300MHz) (x86_64/2 cpu) on linux - 2.6.39-2-amd64 [debian] using cc version 4.6.1 smoketime 1 hour 13 minutes (average 1 hour 13 minutes) Summary: FAIL(F) O = OK F = Failure(s), extended report at the bottom X = Failure(s) under TEST but not under harness ? = still running or test results not (yet) available Build failures during: - = unknown or N/A c = Configure, m = make,...

Smoke [maint-5.14] v5.14.1-1-g8621250 FAIL(XF) linux 2.6.38-10-generic [debian] (x86_64/8 cpu) #2
Smoke logs available at http://m-l.org/~perl/smoke/perl/ Automated smoke report for 5.14.1 patch 8621250723f229ae2fc76d8fadd21389ca4= a3256 v5.14.1-1-g8621250 zwei: Intel(R) Core(TM) i7 CPU 920 @ 2.67GHz (GenuineIntel 1600MHz) (x86_64= /8 cpu) on linux - 2.6.38-10-generic [debian] using clang version 4.2.1 Compatible Clang Compiler smoketime 1 day 3 hours 55 minutes (average 1 hour 23 minutes) Summary: FAIL(XF) O =3D OK F =3D Failure(s), extended report at the bottom X =3D Failure(s) under TEST but not under harness ? =3D still running or test results n...

Smoke [5.6.2] maint-5.6-3-g2bce232 FAIL(m) linux 3.1.0-1-amd64 [debian] (x86_64/8 cpu) #2
Automated smoke report for 5.6.2 patch 2bce2321552345ccb985b6a4b87542c3eaefbac5 maint-5.6-3-g2bce232 gateway: Intel(R) Core(TM) i7-2600 CPU @ 3.40GHz (GenuineIntel 3392MHz) (x86_64/8 cpu) on linux - 3.1.0-1-amd64 [debian] using cc version 4.6.2 smoketime 21 seconds (average 21 seconds) Summary: FAIL(m) O = OK F = Failure(s), extended report at the bottom X = Failure(s) under TEST but not under harness ? = still running or test results not (yet) available Build failures during: - = unknown or N/A c = Configure, m = make, M = make (after miniperl), t =...

Smoke [5.6.2] maint-5.6-3-g2bce232 FAIL(m) linux 3.2.0-1-amd64 [debian] (x86_64/2 cpu) #2
Automated smoke report for 5.6.2 patch 2bce2321552345ccb985b6a4b87542c3eaefbac5 maint-5.6-3-g2bce232 gateway: AMD Athlon(tm) Dual Core Processor 4850e (AuthenticAMD 2200MHz) (x86_64/2 cpu) on linux - 3.2.0-1-amd64 [debian] using cc version 4.6.2 smoketime 55 seconds (average 55 seconds) Summary: FAIL(m) O = OK F = Failure(s), extended report at the bottom X = Failure(s) under TEST but not under harness ? = still running or test results not (yet) available Build failures during: - = unknown or N/A c = Configure, m = make, M = make (after miniperl), t ...

Smoke [5.13.10] v5.13.10-64-gc00ff1c FAIL(c) linux 2.6.37-1-amd64 [debian] (x86_64/2 cpu)
Automated smoke report for 5.13.10 patch c00ff1c7cd54af0ffb12e9cddb484ce0943d6f0d v5.13.10-64-gc00ff1c bandsman.dyndns-ip.com: AMD Athlon(tm) Dual Core Processor 4450e (AuthenticAMD 2300MHz) (x86_64/2 cpu) on linux - 2.6.37-1-amd64 [debian] using ? unknown cc version smoketime 1 seconds (average 1 seconds) Summary: FAIL(c) O = OK F = Failure(s), extended report at the bottom X = Failure(s) under TEST but not under harness ? = still running or test results not (yet) available Build failures during: - = unknown or N/A c = Configure, m = make, M = make...

Smoke [5.13.10] v5.13.10-71-gb3dbdd4 FAIL(c) linux 2.6.37-1-amd64 [debian] (x86_64/2 cpu)
Automated smoke report for 5.13.10 patch b3dbdd48ca2da90bce7f16d545cca54c3dc58f35 v5.13.10-71-gb3dbdd4 bandsman.dyndns-ip.com: AMD Athlon(tm) Dual Core Processor 4450e (AuthenticAMD 2300MHz) (x86_64/2 cpu) on linux - 2.6.37-1-amd64 [debian] using ? unknown cc version smoketime 2 seconds (average 2 seconds) Summary: FAIL(c) O = OK F = Failure(s), extended report at the bottom X = Failure(s) under TEST but not under harness ? = still running or test results not (yet) available Build failures during: - = unknown or N/A c = Configure, m = make, M = make...

Smoke [maint-5.14] v5.14.1-2-ga8dcd97 FAIL(XF) linux 2.6.38-10-generic [debian] (x86_64/8 cpu) #2
Smoke logs available at http://m-l.org/~perl/smoke/perl/ Automated smoke report for 5.14.2 patch a8dcd9729c548cc1f3cf3ec6fcfc8f12dda= b106b v5.14.1-2-ga8dcd97 zwei: Intel(R) Core(TM) i7 CPU 920 @ 2.67GHz (GenuineIntel 2668MHz) (x86_64= /8 cpu) on linux - 2.6.38-10-generic [debian] using clang version 4.2.1 Compatible Clang Compiler smoketime 1 day 7 hours 23 minutes (average 1 hour 34 minutes) Summary: FAIL(XF) O =3D OK F =3D Failure(s), extended report at the bottom X =3D Failure(s) under TEST but not under harness ? =3D still running or test results n...

Smoke [5.6.2] maint-5.6-3-g2bce232 FAIL(m) linux 3.2.0-1-amd64 [debian] (x86_64/2 cpu)
Automated smoke report for 5.6.2 patch 2bce2321552345ccb985b6a4b87542c3eaefbac5 maint-5.6-3-g2bce232 gateway: AMD Athlon(tm) Dual Core Processor 4850e (AuthenticAMD 2500MHz) (x86_64/2 cpu) on linux - 3.2.0-1-amd64 [debian] using cc version 4.6.2 smoketime 4 minutes 20 seconds (average 4 minutes 20 seconds) Summary: FAIL(m) O = OK F = Failure(s), extended report at the bottom X = Failure(s) under TEST but not under harness ? = still running or test results not (yet) available Build failures during: - = unknown or N/A c = Configure, m = make, M = make ...

Smoke [5.6.2] maint-5.6-3-g2bce232 FAIL(F) linux 2.6.32-5-amd64 [debian] (x86_64/2 cpu) #2
Automated smoke report for 5.6.2 patch 2bce2321552345ccb985b6a4b87542c3eaefbac5 maint-5.6-3-g2bce232 bandsman.dyndns-ip.com: AMD Athlon(tm) Dual Core Processor 4450e (AuthenticAMD 1000MHz) (x86_64/2 cpu) on linux - 2.6.32-5-amd64 [debian] using cc version 4.4.5 smoketime 2 minutes 23 seconds (average 2 minutes 23 seconds) Summary: FAIL(F) O = OK F = Failure(s), extended report at the bottom X = Failure(s) under TEST but not under harness ? = still running or test results not (yet) available Build failures during: - = unknown or N/A c = Configure, m =...

Smoke [maint-5.14] v5.14.1-2-ga8dcd97 FAIL(XF) linux 2.6.38-10-generic [debian] (x86_64/8 cpu)
Smoke logs available at http://m-l.org/~perl/smoke/perl/ Automated smoke report for 5.14.2 patch a8dcd9729c548cc1f3cf3ec6fcfc8f12dda= b106b v5.14.1-2-ga8dcd97 zwei: Intel(R) Core(TM) i7 CPU 920 @ 2.67GHz (GenuineIntel 2400MHz) (x86_64= /8 cpu) on linux - 2.6.38-10-generic [debian] using g++ version 4.5.2 smoketime 1 day 3 hours 28 minutes (average 1 hour 22 minutes) Summary: FAIL(XF) O =3D OK F =3D Failure(s), extended report at the bottom X =3D Failure(s) under TEST but not under harness ? =3D still running or test results not (yet) available Build fa...

Web resources about - Smoke [5.10.1] perl-5.10.1-1-gca8de22 FAIL(F) linux 2.6.38-2-amd64 [debian] (x86_64/2 cpu) - perl.perl5.porters

Michigan Governor Upset About Democratic Debate Mention
A Republican politician was upset about being mentioned during the Democratic presidential debate Sunday, but it wasn’t any of the people running ...

Krysten Ritter Hits Up Critics' Choice Awards 2016 After 'Jessica Jones' Renewal
Krysten Ritter sparkles in maroon while arriving at the 2016 Critics’ Choice Awards held at the Barker Hangar on Sunday (January 17) in Santa ...

Riley Keough & Abbey Lee Rep 'Mad Max: Fury Road' at Critics' Choice Awards 2016
Riley Keough looks fierce as she steps out at the 2016 Critics’ Choice Awards held at the Barker Hangar on Sunday (January 17) in Santa Monica, ...

Burkina Faso and Mali to coordinate forces after deadly attacks
By Matthew Mpoke Bigg and Nadoun Coulibaly OUAGADOUGOU (Reuters) - Burkina Faso and Mali have agreed to work together to counter the growing ...

Crews Resume Search for Missing California Ski Instructor
Crews have resumed their search for a ski instructor who went missing at a Northern California ski resort

US Embassy Says Several Americans Missing in Iraq
Fox News US Embassy Says Several Americans Missing in Iraq ABC News The U.S. Embassy confirmed Sunday that "several" Americans have gone missing ...

Jeremy Corbyn says we need back channels to ISIS to end to the Syrian war
The Labour leader stopped short of calling for dialogue with ISIS but compared the situation to when the British government had lines of communication ...

Marco Rubio is so worried about ISIS he bought a gun to fight them off
On Sunday, U.S. Senator Marco Rubio (R-FL) managed to insert himself into the sweet spot between two of the hottest topics in the presidential ...

Microsoft’s Word Flow keyboard on Windows Phone is coming to iOS
Having ported its Cortana intelligent personal assistant from Windows Phone to iOS, Microsoft is apparently set to bring another key functionality ...

Martin Luther King Day 2016: Are Banks Open? A Full List Of What’s Open And What’s Closed
Martin Luther King Jr. Day 2016 has arrived, but folks who want to know if banks are open or are trying to plan a trip to the post office might ...

Resources last updated: 1/18/2016 5:26:32 AM