Smoke [5.10.0] 2009-01-28.01:35:04 FAIL(F) MSWin32 WinXP/.Net SP3 (x86/2 cpu) #3

Automated smoke report for 5.10.0 patch e375ebea75f0a5ab377d133028c97fc794b=
82072 2009-01-28.01:35:04
maldoror.bath.planit.group: Intel(R) Core(TM)2 CPU 6700 @ 2.66GHz(~2660 MHz=
) (x86/2 cpu)
    on        MSWin32 - WinXP/.Net SP3
    using     cl version 14.00.50727.762
    smoketime 5 hours 37 minutes (average 16 minutes 52 seconds)

Summary: FAIL(F)

O =3D OK  F =3D Failure(s), extended report at the bottom
X =3D Failure(s) under TEST but not under harness
? =3D still running or test results not (yet) available
Build failures during:       - =3D unknown or N/A
c =3D Configure, m =3D make, M =3D make (after miniperl), t =3D make test-p=
rep

2009-01-28.01:35:04  Configuration (common) -DCCTYPE=3DMSVC80 -DINST_TOP=3D=
$(INST_DRV)\Smoke\doesntexist
----------- ---------------------------------------------------------
F F=20=20=20=20=20=20=20=20=20
F F         -Dusemymalloc
F F         -Duselargefiles
F F         -Duselargefiles -Dusemymalloc
F F         -Duseithreads -Uuseimpsys
F F         -Duseithreads -Uuseimpsys -Dusemymalloc
F F         -Duseithreads -Uuseimpsys -Duselargefiles
F F         -Duseithreads -Uuseimpsys -Duselargefiles -Dusemymalloc
F F         -Duseithreads
F F         -Duseithreads -Duselargefiles
| +--------- -DDEBUGGING
+----------- no debugging


Locally applied patches:
    MAINT35117
    SMOKEe375ebea75f0a5ab377d133028c97fc794b82072

Failures: (common-args) -DCCTYPE=3DMSVC80 -DINST_TOP=3D$(INST_DRV)\Smoke\do=
esntexist
[default]=20
[default] -DDEBUGGING
[default] -Dusemymalloc
[default] -DDEBUGGING -Dusemymalloc
[default] -Duselargefiles
[default] -DDEBUGGING -Duselargefiles
[default] -Duselargefiles -Dusemymalloc
[default] -DDEBUGGING -Duselargefiles -Dusemymalloc
[default] -Duseithreads -Uuseimpsys
[default] -DDEBUGGING -Duseithreads -Uuseimpsys
[default] -Duseithreads -Uuseimpsys -Dusemymalloc
[default] -DDEBUGGING -Duseithreads -Uuseimpsys -Dusemymalloc
[default] -Duseithreads -Uuseimpsys -Duselargefiles
[default] -DDEBUGGING -Duseithreads -Uuseimpsys -Duselargefiles
[default] -Duseithreads -Uuseimpsys -Duselargefiles -Dusemymalloc
[default] -DDEBUGGING -Duseithreads -Uuseimpsys -Duselargefiles -Dusemymall=
oc
[default] -Duseithreads
[default] -DDEBUGGING -Duseithreads
[default] -DDEBUGGING -Duseithreads -Duselargefiles
.../ext/PerlIO/t/ioleaks.t...................................FAILED
.../lib/Attribute/Handlers/t/linerep.t.......................FAILED
.../lib/Pod/t/text-encoding.t................................FAILED
    2-4

[default] -Duseithreads -Duselargefiles
.../ext/IO/t/io_sock.t.......................................FAILED
.../ext/PerlIO/t/ioleaks.t...................................FAILED
.../lib/Attribute/Handlers/t/linerep.t.......................FAILED
.../lib/Pod/t/text-encoding.t................................FAILED
    2-4

Compiler messages(MSWin32):
Cwd.xs(77) : warning C4101: 'symlink' : unreferenced local variable

--=20
Report by Test::Smoke v1.37 build 1217 running on perl 5.11.0
(Reporter v0.034 / Smoker v0.041)

0
SteveHay
2/6/2009 12:40:00 AM
perl.perl5.porters 48287 articles. 1 followers. Follow

0 Replies
356 Views

Similar Articles

[PageSpeed] 24
Get it on Google Play
Get it on Apple App Store

Reply: