Build error while trying to build debug desktop build on MacOs10.9.5

While trying to build Firefox desktop debug on MacOs10.9.5, I get this
build error:

13:28.99 host_arm_ex_to_module.o
13:29.60 host_dwarf_cfi_to_module.o
13:29.70 /Users/mwargers/mozilla-central/security/pkix/test/gtest/pkixnames_tests.cpp:1077:22:
error: unused variable 'ipv4_other_addr_str'
[-Werror,-Wunused-const-variable]
13:29.70 static const uint8_t ipv4_other_addr_str[] = "5.6.7.8";
13:29.70                      ^
13:29.70 /Users/mwargers/mozilla-central/security/pkix/test/gtest/pkixnames_tests.cpp:1153:22:
error: unused variable 'ipv4_constraint_truncated_bytes'
[-Werror,-Wunused-const-variable]
13:29.70 static const uint8_t ipv4_constraint_truncated_bytes[] = {
13:29.70                      ^
13:29.70 /Users/mwargers/mozilla-central/security/pkix/test/gtest/pkixnames_tests.cpp:1157:22:
error: unused variable 'ipv4_constraint_overlong_bytes'
[-Werror,-Wunused-const-variable]
13:29.70 static const uint8_t ipv4_constraint_overlong_bytes[] = {
13:29.70                      ^
13:29.70 /Users/mwargers/mozilla-central/security/pkix/test/gtest/pkixnames_tests.cpp:1174:22:
error: unused variable 'ipv6_constraint_truncated_bytes'
[-Werror,-Wunused-const-variable]
13:29.70 static const uint8_t ipv6_constraint_truncated_bytes[] = {
13:29.70                      ^
13:29.70 /Users/mwargers/mozilla-central/security/pkix/test/gtest/pkixnames_tests.cpp:1180:22:
error: unused variable 'ipv6_constraint_overlong_bytes'
[-Werror,-Wunused-const-variable]
13:29.70 static const uint8_t ipv6_constraint_overlong_bytes[] = {
13:29.70                      ^
13:29.70 5 errors generated.
13:29.70
13:29.70 In the directory
/Users/mwargers/mozilla-central/obj-x86_64-apple-darwin13.4.0/security/pkix/test/gtest
13:29.70 The following command failed to execute properly:
13:29.70 /usr/local/bin/ccache /usr/bin/clang++ -o pkixnames_tests.o
-c -fvisibility=hidden -DOS_POSIX=1 -DOS_MACOSX=1
-DSTATIC_EXPORTABLE_JS_API -DMOZILLA_INTERNAL_API -DIMPL_LIBXUL
-DAB_CD=en-US -DNO_NSPR_10_SUPPORT
-I/Users/mwargers/mozilla-central/security/pkix/test/gtest -I.
-I/Users/mwargers/mozilla-central/obj-x86_64-apple-darwin13.4.0/ipc/ipdl/_ipdlheaders
-I/Users/mwargers/mozilla-central/security/pkix/test/gtest/../../include
-I/Users/mwargers/mozilla-central/security/pkix/test/gtest/../../lib
-I/Users/mwargers/mozilla-central/security/pkix/test/gtest/../lib
-I/Users/mwargers/mozilla-central/ipc/chromium/src
-I/Users/mwargers/mozilla-central/ipc/glue -I../../../../dist/include
-I/Users/mwargers/mozilla-central/obj-x86_64-apple-darwin13.4.0/dist/include/nspr
-I/Users/mwargers/mozilla-central/obj-x86_64-apple-darwin13.4.0/dist/include/nss
-fPIC -Qunused-arguments -DMOZILLA_CLIENT -include
.../../../../mozilla-config.h -MD -MP -MF .deps/pkixnames_tests.o.pp
-Qunused-arguments -Qunused-arguments -Wall -Wempty-body
-Woverloaded-virtual -Wsign-compare -Wwrite-strings
-Werror=endif-labels -Werror=int-to-pointer-cast
-Werror=missing-braces -Werror=parentheses -Werror=pointer-arith
-Werror=return-type -Werror=sequence-point -Werror=switch
-Werror=trigraphs -Werror=type-limits -Werror=unused-label
-Werror=non-literal-null-conversion -Wno-invalid-offsetof
-Wno-inline-new-delete -Wno-c++0x-extensions -Wno-extended-offsetof
-Wno-unknown-warning-option -Wno-return-type-c-linkage
-Wno-error=uninitialized -Wno-error=deprecated-declarations
-fno-exceptions -fno-strict-aliasing -fno-rtti -fno-exceptions
-fno-math-errno -std=gnu++0x -pthread -DNO_X11 -pipe -DDEBUG -DTRACING
-g -O3 -fno-omit-frame-pointer -Werror
/Users/mwargers/mozilla-central/security/pkix/test/gtest/pkixnames_tests.cpp
13:29.70 make[5]: *** [pkixnames_tests.o] Error 1
13:29.70 make[5]: *** Waiting for unfinished jobs....
13:29.87 host_arch_utilities.o
13:29.87 host_bootstrap_compat.o
13:29.93 host_file_id.o
13:29.94 libxpcom_glue_tests_gtest.a.desc
13:29.98 host_macho_id.o
13:30.01 host_dwarf_cu_to_module.o
13:30.06 host_macho_reader.o
13:30.18 host_macho_utilities.o
13:30.30 libhost_breakpad_dwarf_s.a
13:30.40 gmp-fake.o
13:30.41 gmp-test-decryptor.o
13:30.42 host_dwarf_line_to_module.o
13:30.52 Unified_cpp_unit_tlsserver_lib0.o
13:30.74 host_macho_walker.o
13:30.81 host_string_utilities.o
13:30.90 host_dump_syms.o
13:30.94 gmp-test-storage.o
13:31.04 make[4]: *** [security/pkix/test/gtest/target] Error 2
13:31.04 make[4]: *** Waiting for unfinished jobs....
13:31.26 host_language.o
13:31.46 libgtest.a.desc
13:31.53 host_logging.o
13:31.65 libclearkey.dylib
13:31.69 host_md5.o
13:31.74 host_module.o
13:31.79 host_pathname_stripper.o
13:31.85 host_stabs_reader.o
13:31.90 host_stabs_to_module.o
13:32.03 host_string_conversion.o
13:32.04 libtlsserver.a.desc
13:32.10 host_unique_string.o
13:32.62 libxpcomglue_s_nomozalloc.a
13:32.68 libhost_breakpad_common_s.a
13:32.69 libfake.dylib
13:33.05 libhost_breakpad_mac_common_s.a
13:34.17 libdom_media_gtest.a.desc
13:41.05 libgfx_tests_gtest.a.desc
13:41.08 make[3]: *** [compile] Error 2
13:41.08 make[2]: *** [default] Error 2
13:41.08 make[1]: *** [realbuild] Error 2
13:41.08 make: *** [build] Error 2
13:41.09 82 compiler warnings present.
13:42.15 ccache (direct) hit rate: 0.3%; (preprocessed) hit rate:
0.1%; miss rate: 99.6%
13:42.15 /usr/local/bin/terminal-notifier -title Mozilla Build System
-group mozbuild -message Build complete
mwargers:mozilla-central mwargers$

Anyone has an idea what's going on and why I get this?

This is my .mozconfig file:
ac_add_options --enable-debug
ac_add_options --enable-trace-malloc
ac_add_options --enable-accessibility
ac_add_options --enable-signmar

# Enable parallel compiling
mk_add_options MOZ_MAKE_FLAGS="-j12"
mk_add_options AUTOCLOBBER=1

# Treat warnings as errors in directories with FAIL_ON_WARNINGS.
ac_add_options --enable-warnings-as-errors
ac_add_options --with-ccache


# Package js shell.
export MOZ_PACKAGE_JSSHELL=1

Regards,
Martijn
0
Martijn
12/9/2014 2:26:46 AM
mozilla.dev.builds 1761 articles. 0 followers. Post Follow

0 Replies
1031 Views

Similar Articles

[PageSpeed] 31

Reply:

Similar Artilces:

VS Builds, and Builds, and Builds
Hello, Has anyone else had this problem?  After a while of developing, and I go to compile, VS takes forever to build and I have to end-task it.  It's definitely after I've been working for a while, then it finally has "had it" and just takes forever to build.  It's annoying as I know its not the machine (2.8 GHZ processor and 1GB RAM).  Has anyone else experienced this problem?  By the way, I do have SP1 installed. Also, after minimizing and switching around screens, when it does this, the building icon in the status bar doesn't show.  And, for more informati...

Build error, building for otoro
Hi, I did 'git clone git://github.com/mozilla-b2g/B2G.git b2gotoro'. Then 'cd b2gotoro' Then './config.sh otoro'. Then I got this build error: pull: /system/build.prop -> ../../../backup-otoro/system/build.prop 832 files pulled. 0 files skipped. 5524 KB/s (87724365 bytes in 15.507s) Pulling "libauth.so" 3205 KB/s (9588 bytes in 0.002s) Pulling "libcm.so" 6374 KB/s (231280 bytes in 0.035s) Pulling "libdiag.so" 4425 KB/s (22824 bytes in 0.005s) Pulling "libdivxdrmdecrypt.so" remote object '/system/lib/libdi...

To build or not to build, that is the question
Hello, ever since I found out that VS.NET could upload all of your pages for you, I have used that method for uploading. However when using the Copy Project option, it seems to restart the aspnet service and the sessions clear. What I'm asking is when is it OK just to manually copy/paste some pages into the website directory w/out actually re-building the site? Right now, I have to wait until there are no users logged into my site to do updates, which are very minor, but include code-behind changes. Can I just upload the updated pages w/out building?In this world there are 10 types of pe...

superreview granted: [Bug 54828] Build should default to non-debug/optimized build. : [Attachment 146531] Build moz optimized & non-debug by default
Daniel (Leaf) Nunes <leaf@mozilla.org> has granted Chris Seawood <cls@seawood.org>'s request for superreview: Bug 54828: Build should default to non-debug/optimized build. http://bugzilla.mozilla.org/show_bug.cgi?id=54828 Attachment 146531: Build moz optimized & non-debug by default http://bugzilla.mozilla.org/attachment.cgi?id=146531&action=edit ------- Additional Comments from Daniel (Leaf) Nunes <leaf@mozilla.org> woot. so --disable-debug is a noop now. has this been announced as upcoming in the newsgroups? (obviously, i haven't been keeping up...

superreview requested: [Bug 54828] Build should default to non-debug/optimized build. : [Attachment 146531] Build moz optimized & non-debug by default
Chris Seawood <cls@seawood.org> has asked Daniel (Leaf) Nunes <leaf@mozilla.org> for superreview: Bug 54828: Build should default to non-debug/optimized build. http://bugzilla.mozilla.org/show_bug.cgi?id=54828 Attachment 146531: Build moz optimized & non-debug by default http://bugzilla.mozilla.org/attachment.cgi?id=146531&action=edit ...

superreview requested: [Bug 299404] Can't build dmg of Firefox debug build on Mac : [Attachment 187976] Put DeerPark debug builds in DeerParkDebug.app
Mark Mentovai <mark@moxienet.com> has asked Simon Fraser <sfraser_bugs@smfr.org> for superreview: Bug 299404: Can't build dmg of Firefox debug build on Mac https://bugzilla.mozilla.org/show_bug.cgi?id=299404 Attachment 187976: Put DeerPark debug builds in DeerParkDebug.app https://bugzilla.mozilla.org/attachment.cgi?id=187976&action=edit ...

superreview cancelled: [Bug 299404] Can't build dmg of Firefox debug build on Mac : [Attachment 187976] Put DeerPark debug builds in DeerParkDebug.app
Mark Mentovai <mark@moxienet.com> has cancelled Mark Mentovai <mark@moxienet.com>'s request for superreview: Bug 299404: Can't build dmg of Firefox debug build on Mac https://bugzilla.mozilla.org/show_bug.cgi?id=299404 Attachment 187976: Put DeerPark debug builds in DeerParkDebug.app https://bugzilla.mozilla.org/attachment.cgi?id=187976&action=edit ...

Build error building B2G for Aries
Running: BRANCH=master ./config.sh aries ./build.sh I'm getting the following error when building B2G: ------ pull: /sbin/watchdogd -> ../../../backup-aries/root/sbin/watchdogd 10 files pulled. 0 files skipped. 1161 KB/s (2370098 bytes in 1.991s) Pulling files from ../../../backup-aries Invalid system backup - Wrong base version found: aries-eng 4.4.2 KOT49H eng.worker.20150721.152336 test-keys. Do this: 1. Delete backup-aries 2. Flash your device with KK based images from the vendor 3. Try building again > Build failed! < ------ For context, I...

Rebuild dies on 5.5.05 Build #2509 but works on 5.5.03 Build #1666
I am runing into troubles trrign to extract and re-build. I am runing SQL 5.5.05 Build #2509. When I try to re-build (or extract for DBREMOTE) when it gets to one point where it says: "Error in file reload.sql at line 8560, table DLNK not found" It is in the trigger building stage. If I go to another machine and run it (5.5.03 Build #1666), it works fine. The beginning of the two reload file looks different. The biggest difference is how they issue the GRANT CONNECT TO "DBA" Good version says "GRANT CONNECT TO "DBA" IDENTIFIED BY ENCRYPTED ...

SpiderMonkey works as Debug-build, not as Release-build
Hi, I have build SpiderMonkey 1.7 as a static library using VS2005 to make a macro plugin for Notepad++. What I did was: - Downloaded js-1.7.0.tar.gz - I added a new static library project to my project - Included the required files (used js.mak as reference for this) - Added jsautokw.h from a nmake build - Made some minor modifications to - jstypes.h: remove __declspec() - jsapi.c: remove DllMain() - prmjtime.c: added <windows.h> As a debug-build, everything works great. But as a release-build it crashes when JS_EvaluateScript() is called even with a scr...

superreview cancelled: [Bug 245653] components/build/nsModule tries to build with dogbert migration under BeOS, causing build to fail. AVIARY_1_0_20040515_BRANCH : [Attachment 150078] patch to remove
Mike Connor <mconnor@myrealbox.com> has cancelled Fredrik Holmqvist <thesuckiestemail@yahoo.se>'s request for superreview: Bug 245653: components/build/nsModule tries to build with dogbert migration under BeOS, causing build to fail. AVIARY_1_0_20040515_BRANCH http://bugzilla.mozilla.org/show_bug.cgi?id=245653 Attachment 150078: patch to remove Dogbert from BeOS builds http://bugzilla.mozilla.org/attachment.cgi?id=150078&action=edit ------- Additional Comments from Mike Connor <mconnor@myrealbox.com> r/a=me for landing on aviary/trunk ...

superreview requested: [Bug 245653] components/build/nsModule tries to build with dogbert migration under BeOS, causing build to fail. AVIARY_1_0_20040515_BRANCH : [Attachment 150078] patch to remove
Fredrik Holmqvist <thesuckiestemail@yahoo.se> has asked Brian Ryner (IBM) <bryner@brianryner.com> for superreview: Bug 245653: components/build/nsModule tries to build with dogbert migration under BeOS, causing build to fail. AVIARY_1_0_20040515_BRANCH http://bugzilla.mozilla.org/show_bug.cgi?id=245653 Attachment 150078: patch to remove Dogbert from BeOS builds http://bugzilla.mozilla.org/attachment.cgi?id=150078&action=edit ------- Additional Comments from Fredrik Holmqvist <thesuckiestemail@yahoo.se> requesting sr (and checkin if positive) ...

superreview granted: [Bug 258804] It tries to build Dogbert for BeOS and it's not needed : [Attachment 158497] changes to doesn't build dogbert in a BeOS build
Scott MacGregor <mscott@mozilla.org> has granted timeless@myrealbox.com (working) <timeless@bemail.org>'s request for superreview: Bug 258804: It tries to build Dogbert for BeOS and it's not needed https://bugzilla.mozilla.org/show_bug.cgi?id=258804 Attachment 158497: changes to doesn't build dogbert in a BeOS build https://bugzilla.mozilla.org/attachment.cgi?id=158497&action=edit ...

superreview requested: [Bug 258804] It tries to build Dogbert for BeOS and it's not needed : [Attachment 158497] changes to doesn't build dogbert in a BeOS build
Sergei Dolgov <sergei_d@fi.tartu.ee> has asked timeless@myrealbox.com (working) <timeless@bemail.org> for superreview: Bug 258804: It tries to build Dogbert for BeOS and it's not needed https://bugzilla.mozilla.org/show_bug.cgi?id=258804 Attachment 158497: changes to doesn't build dogbert in a BeOS build https://bugzilla.mozilla.org/attachment.cgi?id=158497&action=edit ------- Additional Comments from Sergei Dolgov <sergei_d@fi.tartu.ee> timeless, are you allowed to sr Thunderbird BeOS bugs? (also need someone for checkin) ...

Web resources about - Build error while trying to build debug desktop build on MacOs10.9.5 - mozilla.dev.builds

Active Desktop - Wikipedia, the free encyclopedia
Windows 95 or NT 4.0 with Internet Explorer 4.0, Windows 98, Windows 2000, Windows ME, Windows XP, Windows Server 2003 Active Desktop was a feature ...

Holiday Buyer’s Guide 2015: Desktop Processors
2015 on the whole has been an interesting play in the land of computer processor land. For anyone buying a new desktop, we had the movement of ...

WordPress site undergoes a major redesign, desktop app launches, code goes open source
... a quarter, in fact. As a CMS it's incredibly flexible, and today the company unveiled not only a new look for WordPress.com, but also a desktop ...

Windows 10 continues to crawl its way onto desktop PCs
The latest version of Microsoft's operating system is making baby steps in its effort to win over users, according to Web tracker NetMarket Share. ...

Encrypted messaging app Signal now available for desktops
The much-lauded encryption app Signal has launched a beta program for a desktop version of the app, which will run through Google's Chrome browser. ...

PlayStation 4 Remote Play Coming to the PC Desktop
A quite amazing piece of technology that’ll have lapsed gamers stunned by what’s possible nowadays is on the way from Sony, with one of its development ...

Here's How To Use Google Play Music From a Desktop App
Google Play Music lives on the web and as several mobile apps. But as you would expect from Google, there’s not much in the way of desktop support. ...

Is Linux Mint a terrible desktop distribution?
In today's open source roundup: A redditor shares his horror at how...er...awful Linux Mint is as a desktop distribution. Plus: 5 memory debuggers ...

WordPress.com Launches Calypso, A Rebuilt Version of Their Blogging Platform and a New Desktop App
WordPress.com has launched a rebuilt open-source version of their popular blogging platform as well as a new WordPress.com desktop app that will ...

The Empty Desktop
... from the time, battery level, and music in the lower left corner, you might think this is just a wallpaper, but it’s not—it’s Dan C ’s desktop, ...

Resources last updated: 12/7/2015 7:36:59 PM