Smoke [blead] v5.15.6-554-gbdd2b37 FAIL(F) MSWin32 Win2000 SP4 (x86/1 cpu)

Smoke logs available at http://m-l.org/~perl/smoke/perl/

Automated smoke report for 5.15.6 patch bdd2b37b5c6133a3b8647bb19d63f959845=
7d4d4 v5.15.6-554-gbdd2b37
perl-win2k: Intel(R) Core(TM) i7 CPU 920 @ 2.67GHz(~2696 MHz) (x86/1 cpu)
    on        MSWin32 - Win2000 SP4
    using     cl version 14.00.50727.762
    smoketime 2 hours 35 minutes (average 38 minutes 50 seconds)

Summary: FAIL(F)

O =3D OK  F =3D Failure(s), extended report at the bottom
X =3D Failure(s) under TEST but not under harness
? =3D still running or test results not (yet) available
Build failures during:       - =3D unknown or N/A
c =3D Configure, m =3D make, M =3D make (after miniperl), t =3D make test-p=
rep

v5.15.6-554-gbdd2b37  Configuration (common) none
----------- ---------------------------------------------------------
O F=20=20=20=20=20=20=20=20=20
F F         -Duseithreads
| +--------- -DDEBUGGING
+----------- no debugging


Locally applied patches:
    uncommitted-changes
    SMOKEbdd2b37b5c6133a3b8647bb19d63f9598457d4d4

Failures: (common-args) none
[default] -DDEBUGGING
.../cpan/IPC-Cmd/t/01_IPC-Cmd.t..............................FAILED
    42
    Non-zero exit status: 1

[default] -Duseithreads
[default] -DDEBUGGING -Duseithreads
.../t/op/fork.t..............................................FAILED
    16

Passed Todo tests: (common-args) none
[default]=20
[default] -DDEBUGGING
[default] -Duseithreads
[default] -DDEBUGGING -Duseithreads
.../cpan/CGI/t/tmpdir.t......................................PASSED
    3-9

Compiler messages(MSWin32):
op.c(10549) : warning C4028: formal parameter 1 different from declaration
...\pp.c(5795) : warning C4244: 'function' : conversion from 'U32' to 'cons=
t char', possible loss of data
...\pp_hot.c(2676) : warning C4244: 'initializing' : conversion from 'I32' =
to 'U8', possible loss of data
...\pp_sort.c(1668) : warning C4244: 'initializing' : conversion from 'I32'=
 to 'U8', possible loss of data
...\toke.c(621) : warning C4047: 'return' : 'char' differs in levels of ind=
irection from 'SV *'
...\toke.c(757) : warning C4244: '=3D' : conversion from 'U32' to 'unsigned=
 short', possible loss of data
IO.xs(488) : warning C4101: 'ret' : unreferenced local variable
ListUtil.xs(297) : warning C4244: 'initializing' : conversion from 'I32' to=
 'U8', possible loss of data
ListUtil.xs(335) : warning C4244: 'initializing' : conversion from 'I32' to=
 'U8', possible loss of data
Base64.xs(394) : warning C4146: unary minus operator applied to unsigned ty=
pe, result still unsigned
Base64.xs(396) : warning C4146: unary minus operator applied to unsigned ty=
pe, result still unsigned
POSIX.xs(705) : warning C4101: 'charstring' : unreferenced local variable
POSIX.xs(1777) : warning C4244: 'initializing' : conversion from 'time_t' t=
o 'const long', possible loss of data
scalar.xs(175) : warning C4018: '>' : signed/unsigned mismatch
Piece.xs(950) : warning C4101: 'ret' : unreferenced local variable
APItest.xs(2990) : warning C4244: 'initializing' : conversion from 'I32' to=
 'U8', possible loss of data
APItest.xs(3284) : warning C4101: 'tmp' : unreferenced local variable
op.c(10549) : warning C4028: formal parameter 2 different from declaration

--=20
Report by Test::Smoke v1.42 build 1267 running on perl 5.10.0
(Reporter v0.035 / Smoker v0.045)

0
perl
1/16/2012 12:56:00 AM
perl.perl5.porters 48235 articles. 1 followers. Follow

0 Replies
6780 Views

Similar Articles

[PageSpeed] 16

Reply:

Similar Artilces:

Smoke [blead] v5.19.6-15-g099ec7d FAIL(F) MSWin32 Win2000 SP4 (x86/1 cpu) {blead}
Automated smoke report for 5.19.7 patch 099ec7dcf9e085a650e6d9010c12ad96492= 09bf4 v5.19.6-15-g099ec7d perl-win2k: Intel(R) Core(TM) i7 CPU 920 @ 2.67GHz(~2669 MHz) (x86/1 cpu) on MSWin32 - Win2000 SP4 using cl version 14.00.50727.762 smoketime 5 hours 3 minutes (average 1 hour 15 minutes) Summary: FAIL(F) O =3D OK F =3D Failure(s), extended report at the bottom X =3D Failure(s) under TEST but not under harness ? =3D still running or test results not (yet) available Build failures during: - =3D unknown or N/A c =3D Configure, m =3D make, M =3D mak...

Smoke [blead] v5.21.1-15-g30962f6 FAIL(F) MSWin32 Win2000 SP4 (x86/1 cpu) {blead}
Automated smoke report for 5.21.2 patch 30962f6865ad51522f9f4f83ca691414fcb= 6eac6 v5.21.1-15-g30962f6 perl-win2k: Intel(R) Core(TM) i7 CPU 920 @ 2.67GHz(~2889 MHz) (x86/1 cpu) on MSWin32 - Win2000 SP4 using cl version 14.00.50727.762 smoketime 5 hours 9 minutes (average 1 hour 17 minutes) Summary: FAIL(F) O =3D OK F =3D Failure(s), extended report at the bottom X =3D Failure(s) under TEST but not under harness ? =3D still running or test results not (yet) available Build failures during: - =3D unknown or N/A c =3D Configure, m =3D make, M =3D mak...

Smoke [blead] v5.19.1-6-g703078b FAIL(F) MSWin32 Win2000 SP4 (x86/1 cpu) {blead}
Automated smoke report for 5.19.2 patch 703078b2cb5abba66f3bf2b3849aef61223= 4420c v5.19.1-6-g703078b perl-win2k: Intel(R) Core(TM) i7 CPU 920 @ 2.67GHz(~2662 MHz) (x86/1 cpu) on MSWin32 - Win2000 SP4 using cl version 14.00.50727.762 smoketime 3 hours 21 minutes (average 50 minutes 22 seconds) Summary: FAIL(F) O =3D OK F =3D Failure(s), extended report at the bottom X =3D Failure(s) under TEST but not under harness ? =3D still running or test results not (yet) available Build failures during: - =3D unknown or N/A c =3D Configure, m =3D make, M =3D...

Smoke [blead] v5.23.1-6-ga619091 FAIL(F) MSWin32 Win2000 SP4 (x86/1 cpu) {blead}
Smoke logs available at http://m-l.org/~perl/smoke/perl/win32/blead/loga619= 091c6e82aa7538af9defae3262a68921e66d.log.gz Known failures on Win32: .../t/win32/popen.t..........................................FAILED Non-zero exit status: 9 No plan found in TAP output .../cpan/Time-HiRes/t/usleep.t...............................FAILED 3 Non-zero exit status: 1 .../t/op/threads.t...........................................FAILED Non-zero exit status: 9 Bad plan. You planned 27 tests but ran 9. .../cpan/IPC-Cmd/t/01_IPC-Cmd.t...............................

Smoke [blead] v5.15.6-651-g130592f FAIL(F) MSWin32 Win2000 SP4 (x86/1 cpu)
Smoke logs available at http://m-l.org/~perl/smoke/perl/ Automated smoke report for 5.15.6 patch 130592f57b42e0a78b31573e6fdfcd4b5f4= ade20 v5.15.6-651-g130592f perl-win2k: Intel(R) Core(TM) i7 CPU 920 @ 2.67GHz(~2696 MHz) (x86/1 cpu) on MSWin32 - Win2000 SP4 using cl version 14.00.50727.762 smoketime 3 hours 13 minutes (average 48 minutes 20 seconds) Summary: FAIL(F) O =3D OK F =3D Failure(s), extended report at the bottom X =3D Failure(s) under TEST but not under harness ? =3D still running or test results not (yet) available Build failures during: ...

Smoke [blead] v5.15.6-449-g7e48232 FAIL(F) MSWin32 Win2000 SP4 (x86/1 cpu)
Smoke logs available at http://m-l.org/~perl/smoke/perl/ Automated smoke report for 5.15.6 patch 7e482323fb2aaa4e52b80f3c50b716c8b6e= f41c8 v5.15.6-449-g7e48232 perl-win2k: Intel(R) Core(TM) i7 CPU 920 @ 2.67GHz(~2693 MHz) (x86/1 cpu) on MSWin32 - Win2000 SP4 using cl version 14.00.50727.762 smoketime 2 hours 54 minutes (average 43 minutes 37 seconds) Summary: FAIL(F) O =3D OK F =3D Failure(s), extended report at the bottom X =3D Failure(s) under TEST but not under harness ? =3D still running or test results not (yet) available Build failures during: ...

Smoke [blead] v5.15.6-530-g93fad93 FAIL(F) MSWin32 Win2000 SP4 (x86/1 cpu)
Smoke logs available at http://m-l.org/~perl/smoke/perl/ Automated smoke report for 5.15.6 patch 93fad9301a05ccd2d02b9949ee59a69708b= 508e1 v5.15.6-530-g93fad93 perl-win2k: Intel(R) Core(TM) i7 CPU 920 @ 2.67GHz(~2696 MHz) (x86/1 cpu) on MSWin32 - Win2000 SP4 using cl version 14.00.50727.762 smoketime 2 hours 31 minutes (average 37 minutes 50 seconds) Summary: FAIL(F) O =3D OK F =3D Failure(s), extended report at the bottom X =3D Failure(s) under TEST but not under harness ? =3D still running or test results not (yet) available Build failures during: ...

Smoke [blead] v5.15.6-556-g86e2f32 FAIL(F) MSWin32 Win2000 SP4 (x86/1 cpu)
Smoke logs available at http://m-l.org/~perl/smoke/perl/ Automated smoke report for 5.15.6 patch 86e2f32949f588e0df48328ed7dfb2e90d8= b142b v5.15.6-556-g86e2f32 perl-win2k: Intel(R) Core(TM) i7 CPU 920 @ 2.67GHz(~2696 MHz) (x86/1 cpu) on MSWin32 - Win2000 SP4 using cl version 14.00.50727.762 smoketime 2 hours 30 minutes (average 37 minutes 39 seconds) Summary: FAIL(F) O =3D OK F =3D Failure(s), extended report at the bottom X =3D Failure(s) under TEST but not under harness ? =3D still running or test results not (yet) available Build failures during: ...

Smoke [blead] v5.15.6-5-g52deee2 FAIL(F) MSWin32 Win2000 SP4 (x86/1 cpu)
Smoke logs available at http://m-l.org/~perl/smoke/perl/ Automated smoke report for 5.15.6 patch 52deee2eb7a29bf84f790e7ae48c845143f= c6940 v5.15.6-5-g52deee2 perl-win2k: Intel(R) Core(TM) i7 CPU 920 @ 2.67GHz(~2661 MHz) (x86/1 cpu) on MSWin32 - Win2000 SP4 using cl version 14.00.50727.762 smoketime 3 hours 8 minutes (average 47 minutes 5 seconds) Summary: FAIL(F) O =3D OK F =3D Failure(s), extended report at the bottom X =3D Failure(s) under TEST but not under harness ? =3D still running or test results not (yet) available Build failures during: ...

Smoke [blead] v5.15.6-578-g6605624 FAIL(F) MSWin32 Win2000 SP4 (x86/1 cpu)
Smoke logs available at http://m-l.org/~perl/smoke/perl/ Automated smoke report for 5.15.6 patch 66056247dd2c721175d33eaf15386969664= 425ea v5.15.6-578-g6605624 perl-win2k: Intel(R) Core(TM) i7 CPU 920 @ 2.67GHz(~2696 MHz) (x86/1 cpu) on MSWin32 - Win2000 SP4 using cl version 14.00.50727.762 smoketime 2 hours 52 minutes (average 43 minutes 14 seconds) Summary: FAIL(F) O =3D OK F =3D Failure(s), extended report at the bottom X =3D Failure(s) under TEST but not under harness ? =3D still running or test results not (yet) available Build failures during: ...

Smoke [blead] v5.15.6-559-g604a99b FAIL(F) MSWin32 Win2000 SP4 (x86/1 cpu)
Smoke logs available at http://m-l.org/~perl/smoke/perl/ Automated smoke report for 5.15.6 patch 604a99bd464c92d77ef2476ab9779cddb72= 339c4 v5.15.6-559-g604a99b perl-win2k: Intel(R) Core(TM) i7 CPU 920 @ 2.67GHz(~2696 MHz) (x86/1 cpu) on MSWin32 - Win2000 SP4 using cl version 14.00.50727.762 smoketime 6 hours 17 minutes (average 1 hour 34 minutes) Summary: FAIL(F) O =3D OK F =3D Failure(s), extended report at the bottom X =3D Failure(s) under TEST but not under harness ? =3D still running or test results not (yet) available Build failures during: ...

Smoke [blead] v5.15.6-583-g33f8979 FAIL(F) MSWin32 Win2000 SP4 (x86/1 cpu)
Smoke logs available at http://m-l.org/~perl/smoke/perl/ Automated smoke report for 5.15.6 patch 33f89799d9328f3d175aa913900d1679411= 9e284 v5.15.6-583-g33f8979 perl-win2k: Intel(R) Core(TM) i7 CPU 920 @ 2.67GHz(~2696 MHz) (x86/1 cpu) on MSWin32 - Win2000 SP4 using cl version 14.00.50727.762 smoketime 2 hours 34 minutes (average 38 minutes 35 seconds) Summary: FAIL(F) O =3D OK F =3D Failure(s), extended report at the bottom X =3D Failure(s) under TEST but not under harness ? =3D still running or test results not (yet) available Build failures during: ...

Smoke [blead] v5.15.6-668-g617373b FAIL(F) MSWin32 Win2000 SP4 (x86/1 cpu)
Smoke logs available at http://m-l.org/~perl/smoke/perl/ Automated smoke report for 5.15.6 patch 617373b760aef94d6f3359e8c264ad9bd2b= d642a v5.15.6-668-g617373b perl-win2k: Intel(R) Core(TM) i7 CPU 920 @ 2.67GHz(~2696 MHz) (x86/1 cpu) on MSWin32 - Win2000 SP4 using cl version 14.00.50727.762 smoketime 2 hours 47 minutes (average 41 minutes 58 seconds) Summary: FAIL(F) O =3D OK F =3D Failure(s), extended report at the bottom X =3D Failure(s) under TEST but not under harness ? =3D still running or test results not (yet) available Build failures during: ...

Smoke [blead] v5.15.6-428-g4c13be3 FAIL(F) MSWin32 Win2000 SP4 (x86/1 cpu)
Smoke logs available at http://m-l.org/~perl/smoke/perl/ Automated smoke report for 5.15.6 patch 4c13be3f693f771014c91d74065ab1f92b5= 83490 v5.15.6-428-g4c13be3 perl-win2k: Intel(R) Core(TM) i7 CPU 920 @ 2.67GHz(~2657 MHz) (x86/1 cpu) on MSWin32 - Win2000 SP4 using cl version 14.00.50727.762 smoketime 3 hours 12 minutes (average 48 minutes 1 seconds) Summary: FAIL(F) O =3D OK F =3D Failure(s), extended report at the bottom X =3D Failure(s) under TEST but not under harness ? =3D still running or test results not (yet) available Build failures during: ...

Web resources about - Smoke [blead] v5.15.6-554-gbdd2b37 FAIL(F) MSWin32 Win2000 SP4 (x86/1 cpu) - perl.perl5.porters

One Direction’s Harry Styles Wears His Mom’s Curtains To AMAs
One Direction star Harry Styles is widely thought of as something of a style icon these days. Last night, Styles and his One Direction bandmates ...

Obama Cautions About Overreaction To Paris Attacks – ‘They’re A Bunch Of Killers With Good Social Media,’ ...
American President Barack Obama has cautioned against overreaction to Paris attacks. Assuring the people that ISIS, the militant group that orchestrated ...

Carson distancing himself from Trump on foreign policy
Republican presidential candidate Ben Carson laid out his plans to deal with the threat of terror and the Syrian refugee crisis in an exclusive ...

New Orleans Playground Shootings: 16 Shot At Bunny Friend Park
A New Orleans playground shooting left 16 people injured on Sunday night. The shooting at Bunny Friend Park began after a verbal dispute between ...

Alabama Republican Has Some Thoughts on All These Dang Syrian Refugees
Were you just saying to yourself how the world could really use more insane rhetoric on the ongoing Syrian refugee crisis? Weh-heh-hell , here ...

End of rainbow: Gordon fails to land 5th title in final race
HOMESTEAD, Fla. (AP) — Jeff Gordon ended up with a goodbye party instead of a championship celebration.

Pfizer to buy Allergan in $160 billion deal
(Reuters) - Pfizer Inc, the maker of Viagra and Lipitor, has struck a deal to buy Botox-maker Allergan Plc in a transaction valued at about $160 ...

Mockingjay Part 2 ruled the box office, did poorly for the series: did you see it?
Mockingjay Part 2 , the final entry in the Hunger Games series, dominated the box office its opening weekend with an expected $101 million take. ...

Washington Post Tehran Bureau Chief Jason Rezaian Reportedly Sentenced To Prison On Espionage Charges ...
Washington Post Tehran Bureau Chief Jason Rezaian has been convicted by an Iranian court to an unspecified amount of prison time, in the latest ...

King's Lynn woman cries after being told husband was dead when he was alive
Ursula Freeman, 79, burst into tears, along with her daughter, Elaine Faxton, 53, when medics at the Queen Elizabeth Hospital in King’s Lynn ...

Resources last updated: 11/23/2015 1:52:22 PM