Smoke [5.9.5] 30562 FAIL(F) linux 2.6.19-1.2288.2.4.fc5 [fedora] (i686/1 cpu)

Automated smoke report for 5.9.5 patch 30562
kirk.peters.homeunix.org: Intel(R) Celeron(R) CPU 2.00GHz (GenuineIntel 199=
4MHz) (i686/1 cpu)
    on        linux - 2.6.19-1.2288.2.4.fc5 [fedora]
    using     suncc version
    smoketime 15 hours 31 minutes (average 58 minutes 14 seconds)

Summary: FAIL(F)

O =3D OK  F =3D Failure(s), extended report at the bottom
X =3D Failure(s) under TEST but not under harness
? =3D still running or test results not (yet) available
Build failures during:       - =3D unknown or N/A
c =3D Configure, m =3D make, M =3D make (after miniperl), t =3D make test-p=
rep

   30562     Configuration (common) -Dcc=3D"suncc"
----------- ---------------------------------------------------------
F O F O=20=20=20=20=20
F O F O     -Duse64bitint
F O F F     -Duselongdouble
F O F F     -Dusemorebits
F F F F     -Duseithreads
F F F F     -Duseithreads -Duse64bitint
F F F F     -Duseithreads -Duselongdouble
F F F F     -Duseithreads -Dusemorebits
| | | +----- PERLIO =3D perlio -DDEBUGGING
| | +------- PERLIO =3D stdio  -DDEBUGGING
| +--------- PERLIO =3D perlio
+----------- PERLIO =3D stdio

Locally applied patches:
    DEVEL
    SMOKE30562

Failures: (common-args) -Dcc=3D"suncc"
[stdio]=20
    ../ext/Compress/Zlib/t/14gzopen.t.......FAILED 139-217
    ../t/io/dup.t...........................FAILED 15-26
    ../t/io/open.t..........................FAILED 93
Inconsistent test results (between TEST and harness):
    ../ext/IO/Compress/Zlib/t/105oneshot-deflate.tFAILED--expected 970 test=
s, saw 173
    ../ext/IO/Compress/Zlib/t/100generic-zip.tFAILED--expected 641 tests, s=
aw 81
    ../ext/IO/Compress/Zlib/t/100generic-rawdeflate.tFAILED--expected 641 t=
ests, saw 81
    ../ext/IO/Compress/Zlib/t/105oneshot-zip.tFAILED--expected 970 tests, s=
aw 173
    ../ext/IO/Compress/Zlib/t/100generic-deflate.tFAILED--expected 641 test=
s, saw 81
    ../ext/IO/Compress/Zlib/t/105oneshot-rawdeflate.tFAILED--expected 970 t=
ests, saw 173
    ../ext/IO/Compress/Zlib/t/100generic-gzip.tFAILED--expected 641 tests, =
saw 81
    ../ext/IO/Compress/Zlib/t/105oneshot-gzip.tFAILED--expected 970 tests, =
saw 173

[stdio] -DDEBUGGING
[stdio] -Duse64bitint
[stdio] -DDEBUGGING -Duse64bitint
[stdio] -Duselongdouble
    ../ext/Compress/Zlib/t/14gzopen.t.......FAILED 139-217
    ../t/io/dup.t...........................FAILED 15-26
    ../t/io/open.t..........................FAILED 93
Inconsistent test results (between TEST and harness):
    ../ext/IO/Compress/Zlib/t/105oneshot-deflate.tFAILED--expected 970 test=
s, saw 173
    ../ext/IO/Compress/Zlib/t/100generic-zip.tFAILED--expected 641 tests, s=
aw 81
    ../ext/IO/Compress/Zlib/t/100generic-rawdeflate.tFAILED--expected 641 t=
ests, saw 81
    ../ext/IO/Compress/Zlib/t/100generic-deflate.tFAILED--expected 641 test=
s, saw 81
    ../ext/IO/Compress/Zlib/t/105oneshot-zip.tFAILED--expected 970 tests, s=
aw 173
    ../ext/IO/Compress/Zlib/t/105oneshot-rawdeflate.tFAILED--expected 970 t=
ests, saw 173
    ../ext/IO/Compress/Zlib/t/100generic-gzip.tFAILED--expected 641 tests, =
saw 81
    ../ext/IO/Compress/Zlib/t/105oneshot-gzip.tFAILED--expected 970 tests, =
saw 173

[stdio] -DDEBUGGING -Duselongdouble
    ../ext/B/t/concise-xs.t.................FAILED 812-1594
    ../ext/Compress/Zlib/t/14gzopen.t.......FAILED 139-217
    ../ext/DB_File/t/db-btree.t.............FAILED ??
    ../ext/DB_File/t/db-hash.t..............FAILED ??
    ../ext/DB_File/t/db-recno.t.............FAILED ??
    ../ext/IO/t/IO.t........................FAILED 5-18
    ../ext/IO/t/io_multihomed.t.............FAILED ??
    ../ext/IO/t/io_sock.t...................FAILED ??
    ../ext/IO/t/io_udp.t....................FAILED ??
    ../ext/IO/t/io_unix.t...................FAILED ??
    ../ext/IO/t/io_xs.t.....................FAILED ??
    ../ext/NDBM_File/t/ndbm.t...............FAILED ??
    ../ext/POSIX/t/posix.t..................FAILED ??
    ../ext/POSIX/t/sysconf.t................FAILED 1-87
    ../ext/Sys/Syslog/t/00-load.t...........FAILED 1
    ../ext/Sys/Syslog/t/constants.t.........FAILED 1-3 5 7 9 11
                                                   13 15 17 19 21
                                                   23 25 27 29 31
                                                   33 35 37 39 41
                                                   43 45 47 49 51
                                                   53 55 57 59 61
                                                   63 65 67 69 71
                                                   73 75 77 79 81
                                                   83 85 87
    ../ext/Sys/Syslog/t/syslog.t............FAILED 1 3-159
    ../lib/Locale/Codes/t/all.t.............FAILED ??
    ../lib/Net/Ping/t/100_load.t............FAILED 1
    ../lib/Net/Ping/t/110_icmp_inst.t.......FAILED ??
    ../lib/Net/Ping/t/120_udp_inst.t........FAILED ??
    ../lib/Net/Ping/t/130_tcp_inst.t........FAILED ??
    ../lib/Net/Ping/t/140_stream_inst.t.....FAILED ??
    ../lib/Net/Ping/t/150_syn_inst.t........FAILED ??
    ../lib/Net/Ping/t/190_alarm.t...........FAILED ??
    ../lib/Net/Ping/t/500_ping_icmp.t.......FAILED ??
    ../lib/Net/Ping/t/510_ping_udp.t........FAILED ??
    ../lib/Net/t/ftp.t......................FAILED ??
    ../lib/Net/t/nntp.t.....................FAILED ??
    ../lib/Net/t/require.t..................FAILED 5-9
    ../lib/Net/t/smtp.t.....................FAILED ??
    ../t/io/dup.t...........................FAILED 15-26
    ../t/io/open.t..........................FAILED 93
    ../t/lib/1_compile.t....................FAILED 3
    ../t/lib/proxy_constant_subs.t..........FAILED 5-8
    ../t/op/taint.t.........................FAILED ??
Inconsistent test results (between TEST and harness):
    ../ext/IO/Compress/Zlib/t/105oneshot-deflate.tFAILED--expected 970 test=
s, saw 173
    ../ext/IO/Compress/Zlib/t/100generic-rawdeflate.tFAILED--expected 641 t=
ests, saw 81
    ../ext/IO/Compress/Zlib/t/105oneshot-zip.tFAILED--expected 970 tests, s=
aw 173
    ../ext/IO/Compress/Zlib/t/105oneshot-rawdeflate.tFAILED--expected 970 t=
ests, saw 173
    ../ext/IO/Compress/Zlib/t/105oneshot-gzip.tFAILED--expected 970 tests, =
saw 173
    ../lib/Memoize/t/speed.t................FAILED at test 2
    ../ext/IO/Compress/Zlib/t/100generic-zip.tFAILED--expected 641 tests, s=
aw 81
    ../ext/IO/Compress/Zlib/t/100generic-gzip.tFAILED--expected 641 tests, =
saw 81
    ../ext/IO/Compress/Zlib/t/100generic-deflate.tFAILED--expected 641 test=
s, saw 81

[perlio] -DDEBUGGING -Duselongdouble
[perlio] -DDEBUGGING -Dusemorebits
    ../ext/B/t/concise-xs.t.................FAILED 812-1594
    ../ext/DB_File/t/db-btree.t.............FAILED ??
    ../ext/DB_File/t/db-hash.t..............FAILED ??
    ../ext/DB_File/t/db-recno.t.............FAILED ??
    ../ext/IO/t/IO.t........................FAILED 5-18
    ../ext/IO/t/io_multihomed.t.............FAILED ??
    ../ext/IO/t/io_sock.t...................FAILED ??
    ../ext/IO/t/io_udp.t....................FAILED ??
    ../ext/IO/t/io_unix.t...................FAILED ??
    ../ext/IO/t/io_xs.t.....................FAILED ??
    ../ext/NDBM_File/t/ndbm.t...............FAILED ??
    ../ext/POSIX/t/posix.t..................FAILED ??
    ../ext/POSIX/t/sysconf.t................FAILED 1-87
    ../ext/Sys/Syslog/t/00-load.t...........FAILED 1
    ../ext/Sys/Syslog/t/constants.t.........FAILED 1-3 5 7 9 11 13 15
                                                   17 19 21 23 25 27 29
                                                   31 33 35 37 39 41 43
                                                   45 47 49 51 53 55 57
                                                   59 61 63 65 67 69 71
                                                   73 75 77 79 81 83 85
                                                   87
    ../ext/Sys/Syslog/t/syslog.t............FAILED 1 3-159
    ../lib/Locale/Codes/t/all.t.............FAILED ??
    ../lib/Net/Ping/t/100_load.t............FAILED 1
    ../lib/Net/Ping/t/110_icmp_inst.t.......FAILED ??
    ../lib/Net/Ping/t/120_udp_inst.t........FAILED ??
    ../lib/Net/Ping/t/130_tcp_inst.t........FAILED ??
    ../lib/Net/Ping/t/140_stream_inst.t.....FAILED ??
    ../lib/Net/Ping/t/150_syn_inst.t........FAILED ??
    ../lib/Net/Ping/t/190_alarm.t...........FAILED ??
    ../lib/Net/Ping/t/500_ping_icmp.t.......FAILED ??
    ../lib/Net/Ping/t/510_ping_udp.t........FAILED ??
    ../lib/Net/t/ftp.t......................FAILED ??
    ../lib/Net/t/nntp.t.....................FAILED ??
    ../lib/Net/t/require.t..................FAILED 5-9
    ../lib/Net/t/smtp.t.....................FAILED ??
    ../t/lib/1_compile.t....................FAILED 3
    ../t/lib/proxy_constant_subs.t..........FAILED 5-8
    ../t/op/taint.t.........................FAILED ??

[stdio] -Dusemorebits
    ../ext/Compress/Zlib/t/14gzopen.t.......FAILED 139-217
    ../t/io/dup.t...........................FAILED 15-26
    ../t/io/open.t..........................FAILED 93
Inconsistent test results (between TEST and harness):
    ../ext/IO/Compress/Zlib/t/105oneshot-deflate.tFAILED--expected 970 test=
s, saw 173
    ../ext/IO/Compress/Zlib/t/100generic-rawdeflate.tFAILED--expected 641 t=
ests, saw 81
    ../ext/IO/Compress/Zlib/t/105oneshot-zip.tFAILED--expected 970 tests, s=
aw 173
    ../ext/IO/Compress/Zlib/t/105oneshot-rawdeflate.tFAILED--expected 970 t=
ests, saw 173
    ../ext/IO/Compress/Zlib/t/105oneshot-gzip.tFAILED--expected 970 tests, =
saw 173
    ../ext/IO/Compress/Zlib/t/100generic-zip.tFAILED--expected 641 tests, s=
aw 81
    ../ext/IO/Compress/Zlib/t/100generic-gzip.tFAILED--expected 641 tests, =
saw 81
    ../ext/IO/Compress/Zlib/t/100generic-deflate.tFAILED--expected 641 test=
s, saw 81

[stdio] -DDEBUGGING -Dusemorebits
    ../ext/B/t/concise-xs.t.................FAILED 812-1594
    ../ext/Compress/Zlib/t/14gzopen.t.......FAILED 139-217
    ../ext/DB_File/t/db-btree.t.............FAILED ??
    ../ext/DB_File/t/db-hash.t..............FAILED ??
    ../ext/DB_File/t/db-recno.t.............FAILED ??
    ../ext/IO/t/IO.t........................FAILED 5-18
    ../ext/IO/t/io_multihomed.t.............FAILED ??
    ../ext/IO/t/io_sock.t...................FAILED ??
    ../ext/IO/t/io_udp.t....................FAILED ??
    ../ext/IO/t/io_unix.t...................FAILED ??
    ../ext/IO/t/io_xs.t.....................FAILED ??
    ../ext/NDBM_File/t/ndbm.t...............FAILED ??
    ../ext/POSIX/t/posix.t..................FAILED ??
    ../ext/POSIX/t/sysconf.t................FAILED 1-87
    ../ext/Sys/Syslog/t/00-load.t...........FAILED 1
    ../ext/Sys/Syslog/t/constants.t.........FAILED 1-3 5 7 9 11
                                                   13 15 17 19 21
                                                   23 25 27 29 31
                                                   33 35 37 39 41
                                                   43 45 47 49 51
                                                   53 55 57 59 61
                                                   63 65 67 69 71
                                                   73 75 77 79 81
                                                   83 85 87
    ../ext/Sys/Syslog/t/syslog.t............FAILED 1 3-159
    ../lib/Locale/Codes/t/all.t.............FAILED ??
    ../lib/Net/Ping/t/100_load.t............FAILED 1
    ../lib/Net/Ping/t/110_icmp_inst.t.......FAILED ??
    ../lib/Net/Ping/t/120_udp_inst.t........FAILED ??
    ../lib/Net/Ping/t/130_tcp_inst.t........FAILED ??
    ../lib/Net/Ping/t/140_stream_inst.t.....FAILED ??
    ../lib/Net/Ping/t/150_syn_inst.t........FAILED ??
    ../lib/Net/Ping/t/190_alarm.t...........FAILED ??
    ../lib/Net/Ping/t/500_ping_icmp.t.......FAILED ??
    ../lib/Net/Ping/t/510_ping_udp.t........FAILED ??
    ../lib/Net/t/ftp.t......................FAILED ??
    ../lib/Net/t/nntp.t.....................FAILED ??
    ../lib/Net/t/require.t..................FAILED 5-9
    ../lib/Net/t/smtp.t.....................FAILED ??
    ../t/io/dup.t...........................FAILED 15-26
    ../t/io/open.t..........................FAILED 93
    ../t/lib/1_compile.t....................FAILED 3
    ../t/lib/proxy_constant_subs.t..........FAILED 5-8
    ../t/op/taint.t.........................FAILED ??
Inconsistent test results (between TEST and harness):
    ../ext/IO/Compress/Zlib/t/105oneshot-deflate.tFAILED--expected 970 test=
s, saw 173
    ../ext/IO/Compress/Zlib/t/100generic-rawdeflate.tFAILED--expected 641 t=
ests, saw 81
    ../ext/IO/Compress/Zlib/t/105oneshot-zip.tFAILED--expected 970 tests, s=
aw 173
    ../ext/IO/Compress/Zlib/t/105oneshot-rawdeflate.tFAILED--expected 970 t=
ests, saw 173
    ../ext/IO/Compress/Zlib/t/105oneshot-gzip.tFAILED--expected 970 tests, =
saw 173
    ../ext/IO/Compress/Zlib/t/100generic-zip.tFAILED--expected 641 tests, s=
aw 81
    ../ext/IO/Compress/Zlib/t/100generic-gzip.tFAILED--expected 641 tests, =
saw 81
    ../ext/IO/Compress/Zlib/t/100generic-deflate.tFAILED--expected 641 test=
s, saw 81

[stdio] -Duseithreads
    ../ext/Compress/Zlib/t/14gzopen.t.......FAILED 139-217
    ../ext/Hash/Util/FieldHash/t/03_class.t.FAILED 3-7
    ../ext/Hash/Util/FieldHash/t/04_thread.tFAILED 7-30
    ../ext/IO/t/io_pipe.t...................FAILED 9-10
    ../ext/POSIX/t/posix.t..................FAILED 11-66
    ../ext/POSIX/t/sigaction.t..............FAILED 25-31
    ../ext/Socket/t/socketpair.t............FAILED 36-45
    ../ext/Storable/t/threads.t.............FAILED ??
    ../ext/Time/HiRes/t/HiRes.t.............FAILED 12-38
    ../ext/XS/APItest/t/my_cxt.t............FAILED ??
    ../ext/threads/shared/t/av_refs.t.......FAILED 2-14
    ../ext/threads/shared/t/av_simple.t.....FAILED 2-44
    ../ext/threads/shared/t/blessed.t.......FAILED 2-37
    ../ext/threads/shared/t/cond.t..........FAILED 2-82
    ../ext/threads/shared/t/hv_refs.t.......FAILED 2-20
    ../ext/threads/shared/t/hv_simple.t.....FAILED 2-16
    ../ext/threads/shared/t/no_share.t......FAILED 4-6
    ../ext/threads/shared/t/shared_attr.t...FAILED 2-101
    ../ext/threads/shared/t/sv_refs.t.......FAILED 2-11
    ../ext/threads/shared/t/sv_simple.t.....FAILED 2-11
    ../ext/threads/shared/t/wait.t..........FAILED 6-103
    ../ext/threads/t/basic.t................FAILED 3-33
    ../ext/threads/t/blocks.t...............FAILED 1-5
    ../ext/threads/t/context.t..............FAILED 1-31
    ../ext/threads/t/end.t..................FAILED 1-6
    ../ext/threads/t/err.t..................FAILED 2-10
    ../ext/threads/t/exit.t.................FAILED 2-18
    ../ext/threads/t/free.t.................FAILED 1-29
    ../ext/threads/t/free2.t................FAILED 1-78
    ../ext/threads/t/join.t.................FAILED 1-20
    ../ext/threads/t/kill.t.................FAILED ??
    ../ext/threads/t/libc.t.................FAILED 2-11
    ../ext/threads/t/list.t.................FAILED 3-15
    ../ext/threads/t/problems.t.............FAILED 2-15
    ../ext/threads/t/stack.t................FAILED 5-18
    ../ext/threads/t/state.t................FAILED 1-59
    ../ext/threads/t/stress_cv.t............FAILED 3-63
    ../ext/threads/t/stress_re.t............FAILED 2-31
    ../ext/threads/t/stress_string.t........FAILED 3-63
    ../ext/threads/t/thread.t...............FAILED 2-31
    ../lib/Net/Ping/t/190_alarm.t...........FAILED 5-6
    ../lib/Test/Simple/t/diag.t.............FAILED ??
    ../lib/Test/Simple/t/overload_threads.t.FAILED ??
    ../lib/Test/Simple/t/sort_bug.t.........FAILED ??
    ../lib/Test/Simple/t/threads.t..........FAILED ??
    ../lib/Thread/Queue.t...................FAILED ??
    ../lib/vars.t...........................FAILED 17-27
    ../lib/warnings.t.......................FAILED 288
    ../t/io/dup.t...........................FAILED 15-26
    ../t/io/open.t..........................FAILED 93
    ../t/io/pipe.t..........................FAILED 9-24
    ../t/op/alarm.t.........................FAILED ??
    ../t/op/getpid.t........................FAILED ??
    ../t/op/magic.t.........................FAILED 3-5
    ../t/op/threads.t.......................FAILED 1-6
Inconsistent test results (between TEST and harness):
    ../ext/IO/Compress/Zlib/t/105oneshot-deflate.tFAILED--expected 970 test=
s, saw 173
    ../ext/IO/Compress/Zlib/t/100generic-rawdeflate.tFAILED--expected 641 t=
ests, saw 81
    ../ext/IO/Compress/Zlib/t/105oneshot-zip.tFAILED--expected 970 tests, s=
aw 173
    ../ext/IO/Compress/Zlib/t/105oneshot-rawdeflate.tFAILED--expected 970 t=
ests, saw 173
    ../ext/IO/Compress/Zlib/t/105oneshot-gzip.tFAILED--expected 970 tests, =
saw 173
    ../ext/IO/Compress/Zlib/t/100generic-zip.tFAILED--expected 641 tests, s=
aw 81
    ../ext/IO/Compress/Zlib/t/100generic-gzip.tFAILED--expected 641 tests, =
saw 81
    ../ext/IO/Compress/Zlib/t/100generic-deflate.tFAILED--expected 641 test=
s, saw 81

[perlio] -Duseithreads
[perlio] -Duseithreads -Duselongdouble
[perlio] -Duseithreads -Dusemorebits
    ../ext/IO/t/io_pipe.t...................FAILED 9-10
    ../ext/POSIX/t/posix.t..................FAILED 11-66
    ../ext/POSIX/t/sigaction.t..............FAILED 25-31
    ../ext/Socket/t/socketpair.t............FAILED 36-45
    ../ext/Storable/t/threads.t.............FAILED ??
    ../ext/Time/HiRes/t/HiRes.t.............FAILED 12-38
    ../ext/XS/APItest/t/my_cxt.t............FAILED ??
    ../ext/threads/shared/t/av_refs.t.......FAILED 2-14
    ../ext/threads/shared/t/av_simple.t.....FAILED 2-44
    ../ext/threads/shared/t/blessed.t.......FAILED 2-37
    ../ext/threads/shared/t/cond.t..........FAILED 2-82
    ../ext/threads/shared/t/hv_refs.t.......FAILED 2-20
    ../ext/threads/shared/t/hv_simple.t.....FAILED 2-16
    ../ext/threads/shared/t/shared_attr.t...FAILED 2-101
    ../ext/threads/shared/t/sv_refs.t.......FAILED 2-11
    ../ext/threads/shared/t/sv_simple.t.....FAILED 2-11
    ../ext/threads/shared/t/wait.t..........FAILED 6-103
    ../ext/threads/t/blocks.t...............FAILED 1-5
    ../ext/threads/t/context.t..............FAILED 1-31
    ../ext/threads/t/end.t..................FAILED 1-6
    ../ext/threads/t/exit.t.................FAILED 9-18
    ../ext/threads/t/free.t.................FAILED 1-29
    ../ext/threads/t/free2.t................FAILED 1-78
    ../ext/threads/t/join.t.................FAILED 1-20
    ../ext/threads/t/kill.t.................FAILED 1-19
    ../ext/threads/t/problems.t.............FAILED 2-15
    ../ext/threads/t/state.t................FAILED 1-59
    ../ext/threads/t/thread.t...............FAILED 4-31
    ../lib/Net/Ping/t/190_alarm.t...........FAILED 5-6
    ../lib/Test/Simple/t/diag.t.............FAILED ??
    ../lib/Test/Simple/t/overload_threads.t.FAILED ??
    ../lib/Test/Simple/t/sort_bug.t.........FAILED ??
    ../lib/Test/Simple/t/threads.t..........FAILED ??
    ../lib/Thread/Queue.t...................FAILED ??
    ../lib/warnings.t.......................FAILED 288
    ../t/io/pipe.t..........................FAILED 9-24
    ../t/op/alarm.t.........................FAILED ??
    ../t/op/getpid.t........................FAILED ??
    ../t/op/magic.t.........................FAILED 3-5

[stdio] -DDEBUGGING -Duseithreads
[stdio] -DDEBUGGING -Duseithreads -Duse64bitint
    ../ext/Compress/Zlib/t/14gzopen.t.......FAILED 139-217
    ../ext/Hash/Util/FieldHash/t/03_class.t.FAILED 3-7
    ../ext/Hash/Util/FieldHash/t/04_thread.tFAILED 7-30
    ../ext/Storable/t/threads.t.............FAILED ??
    ../ext/XS/APItest/t/my_cxt.t............FAILED ??
    ../ext/threads/shared/t/av_refs.t.......FAILED 2-14
    ../ext/threads/shared/t/av_simple.t.....FAILED 2-44
    ../ext/threads/shared/t/blessed.t.......FAILED 2-37
    ../ext/threads/shared/t/cond.t..........FAILED 2-82
    ../ext/threads/shared/t/hv_refs.t.......FAILED 2-20
    ../ext/threads/shared/t/hv_simple.t.....FAILED 2-16
    ../ext/threads/shared/t/no_share.t......FAILED 4-6
    ../ext/threads/shared/t/shared_attr.t...FAILED 2-101
    ../ext/threads/shared/t/sv_refs.t.......FAILED 2-11
    ../ext/threads/shared/t/sv_simple.t.....FAILED 2-11
    ../ext/threads/shared/t/wait.t..........FAILED 6-103
    ../ext/threads/t/basic.t................FAILED 3-33
    ../ext/threads/t/blocks.t...............FAILED 1-5
    ../ext/threads/t/context.t..............FAILED 1-31
    ../ext/threads/t/end.t..................FAILED 1-6
    ../ext/threads/t/err.t..................FAILED 2-10
    ../ext/threads/t/exit.t.................FAILED 2-18
    ../ext/threads/t/free.t.................FAILED 1-29
    ../ext/threads/t/free2.t................FAILED 1-78
    ../ext/threads/t/join.t.................FAILED 1-20
    ../ext/threads/t/kill.t.................FAILED ??
    ../ext/threads/t/libc.t.................FAILED 2-11
    ../ext/threads/t/list.t.................FAILED 3-15
    ../ext/threads/t/problems.t.............FAILED 2-15
    ../ext/threads/t/stack.t................FAILED 5-18
    ../ext/threads/t/state.t................FAILED 1-59
    ../ext/threads/t/stress_cv.t............FAILED 3-63
    ../ext/threads/t/stress_re.t............FAILED 2-31
    ../ext/threads/t/stress_string.t........FAILED 3-63
    ../ext/threads/t/thread.t...............FAILED 2-31
    ../lib/Test/Simple/t/diag.t.............FAILED ??
    ../lib/Test/Simple/t/overload_threads.t.FAILED ??
    ../lib/Test/Simple/t/sort_bug.t.........FAILED ??
    ../lib/Test/Simple/t/threads.t..........FAILED ??
    ../lib/Thread/Queue.t...................FAILED ??
    ../t/io/dup.t...........................FAILED 15-26
    ../t/io/open.t..........................FAILED 93
    ../t/op/getpid.t........................FAILED ??
    ../t/op/threads.t.......................FAILED 1-6
Inconsistent test results (between TEST and harness):
    ../ext/IO/Compress/Zlib/t/105oneshot-deflate.tFAILED--expected 970 test=
s, saw 173
    ../ext/IO/Compress/Zlib/t/100generic-rawdeflate.tFAILED--expected 641 t=
ests, saw 81
    ../ext/IO/Compress/Zlib/t/105oneshot-zip.tFAILED--expected 970 tests, s=
aw 173
    ../ext/IO/Compress/Zlib/t/105oneshot-rawdeflate.tFAILED--expected 970 t=
ests, saw 173
    ../ext/IO/Compress/Zlib/t/105oneshot-gzip.tFAILED--expected 970 tests, =
saw 173
    ../ext/IO/Compress/Zlib/t/100generic-zip.tFAILED--expected 641 tests, s=
aw 81
    ../ext/IO/Compress/Zlib/t/100generic-gzip.tFAILED--expected 641 tests, =
saw 81
    ../ext/IO/Compress/Zlib/t/100generic-deflate.tFAILED--expected 641 test=
s, saw 81

[perlio] -DDEBUGGING -Duseithreads
[perlio] -DDEBUGGING -Duseithreads -Duse64bitint
    ../ext/Storable/t/threads.t.............FAILED ??
    ../ext/XS/APItest/t/my_cxt.t............FAILED ??
    ../ext/threads/shared/t/av_refs.t.......FAILED 2-14
    ../ext/threads/shared/t/av_simple.t.....FAILED 2-44
    ../ext/threads/shared/t/blessed.t.......FAILED 2-37
    ../ext/threads/shared/t/cond.t..........FAILED 2-82
    ../ext/threads/shared/t/hv_refs.t.......FAILED 2-20
    ../ext/threads/shared/t/hv_simple.t.....FAILED 2-16
    ../ext/threads/shared/t/shared_attr.t...FAILED 2-101
    ../ext/threads/shared/t/sv_refs.t.......FAILED 2-11
    ../ext/threads/shared/t/sv_simple.t.....FAILED 2-11
    ../ext/threads/shared/t/wait.t..........FAILED 6-103
    ../ext/threads/t/blocks.t...............FAILED 1-5
    ../ext/threads/t/context.t..............FAILED 1-31
    ../ext/threads/t/end.t..................FAILED 1-6
    ../ext/threads/t/exit.t.................FAILED 9-18
    ../ext/threads/t/free.t.................FAILED 1-29
    ../ext/threads/t/free2.t................FAILED 1-78
    ../ext/threads/t/join.t.................FAILED 1-20
    ../ext/threads/t/kill.t.................FAILED 1-19
    ../ext/threads/t/problems.t.............FAILED 2-15
    ../ext/threads/t/state.t................FAILED 1-59
    ../ext/threads/t/thread.t...............FAILED 4-31
    ../lib/Test/Simple/t/diag.t.............FAILED ??
    ../lib/Test/Simple/t/overload_threads.t.FAILED ??
    ../lib/Test/Simple/t/sort_bug.t.........FAILED ??
    ../lib/Test/Simple/t/threads.t..........FAILED ??
    ../lib/Thread/Queue.t...................FAILED ??
    ../t/op/getpid.t........................FAILED ??

[stdio] -Duseithreads -Duse64bitint
[stdio] -Duseithreads -Duselongdouble
    ../ext/Compress/Zlib/t/14gzopen.t.......FAILED 139-217
    ../ext/Hash/Util/FieldHash/t/03_class.t.FAILED 3-7
    ../ext/Hash/Util/FieldHash/t/04_thread.tFAILED 7-30
    ../ext/IO/t/io_pipe.t...................FAILED 9-10
    ../ext/POSIX/t/posix.t..................FAILED 11-66
    ../ext/POSIX/t/sigaction.t..............FAILED 25-31
    ../ext/Socket/t/socketpair.t............FAILED 36-45
    ../ext/Storable/t/threads.t.............FAILED ??
    ../ext/Time/HiRes/t/HiRes.t.............FAILED 12-38
    ../ext/XS/APItest/t/my_cxt.t............FAILED ??
    ../ext/threads/shared/t/av_refs.t.......FAILED 2-14
    ../ext/threads/shared/t/av_simple.t.....FAILED 2-44
    ../ext/threads/shared/t/blessed.t.......FAILED 2-37
    ../ext/threads/shared/t/cond.t..........FAILED 2-82
    ../ext/threads/shared/t/hv_refs.t.......FAILED 2-20
    ../ext/threads/shared/t/hv_simple.t.....FAILED 2-16
    ../ext/threads/shared/t/no_share.t......FAILED 4-6
    ../ext/threads/shared/t/shared_attr.t...FAILED 2-101
    ../ext/threads/shared/t/sv_refs.t.......FAILED 2-11
    ../ext/threads/shared/t/sv_simple.t.....FAILED 2-11
    ../ext/threads/shared/t/wait.t..........FAILED 6-103
    ../ext/threads/t/basic.t................FAILED 3-33
    ../ext/threads/t/blocks.t...............FAILED 1-5
    ../ext/threads/t/context.t..............FAILED 1-31
    ../ext/threads/t/end.t..................FAILED 1-6
    ../ext/threads/t/err.t..................FAILED 2-10
    ../ext/threads/t/exit.t.................FAILED 2-18
    ../ext/threads/t/free.t.................FAILED 1-29
    ../ext/threads/t/free2.t................FAILED 1-78
    ../ext/threads/t/join.t.................FAILED 1-20
    ../ext/threads/t/kill.t.................FAILED ??
    ../ext/threads/t/libc.t.................FAILED 2-11
    ../ext/threads/t/list.t.................FAILED 3-15
    ../ext/threads/t/problems.t.............FAILED 2-15
    ../ext/threads/t/stack.t................FAILED 5-18
    ../ext/threads/t/state.t................FAILED 1-59
    ../ext/threads/t/stress_cv.t............FAILED 3-63
    ../ext/threads/t/stress_re.t............FAILED 2-31
    ../ext/threads/t/stress_string.t........FAILED 3-63
    ../ext/threads/t/thread.t...............FAILED 2-31
    ../lib/Net/Ping/t/190_alarm.t...........FAILED 5-6
    ../lib/Test/Simple/t/diag.t.............FAILED ??
    ../lib/Test/Simple/t/overload_threads.t.FAILED ??
    ../lib/Test/Simple/t/sort_bug.t.........FAILED ??
    ../lib/Test/Simple/t/threads.t..........FAILED ??
    ../lib/Thread/Queue.t...................FAILED ??
    ../lib/warnings.t.......................FAILED 288
    ../t/io/dup.t...........................FAILED 15-26
    ../t/io/open.t..........................FAILED 93
    ../t/io/pipe.t..........................FAILED 9-24
    ../t/op/alarm.t.........................FAILED ??
    ../t/op/getpid.t........................FAILED ??
    ../t/op/magic.t.........................FAILED 3-5
    ../t/op/threads.t.......................FAILED 1-6
Inconsistent test results (between TEST and harness):
    ../ext/IO/Compress/Zlib/t/105oneshot-deflate.tFAILED--expected 970 test=
s, saw 173
    ../ext/IO/Compress/Zlib/t/100generic-rawdeflate.tFAILED--expected 641 t=
ests, saw 81
    ../ext/IO/Compress/Zlib/t/105oneshot-zip.tFAILED--expected 970 tests, s=
aw 173
    ../ext/IO/Compress/Zlib/t/105oneshot-rawdeflate.tFAILED--expected 970 t=
ests, saw 173
    ../ext/IO/Compress/Zlib/t/105oneshot-gzip.tFAILED--expected 970 tests, =
saw 173
    ../ext/IO/Compress/Zlib/t/100generic-zip.tFAILED--expected 641 tests, s=
aw 81
    ../ext/IO/Compress/Zlib/t/100generic-gzip.tFAILED--expected 641 tests, =
saw 81
    ../ext/IO/Compress/Zlib/t/100generic-deflate.tFAILED--expected 641 test=
s, saw 81

[perlio] -Duseithreads -Duse64bitint
    ../ext/IO/t/io_pipe.t...................FAILED 9-10
    ../ext/POSIX/t/posix.t..................FAILED 11-66
    ../ext/POSIX/t/sigaction.t..............FAILED 25-31
    ../ext/Socket/t/socketpair.t............FAILED 36-45
    ../ext/Storable/t/threads.t.............FAILED ??
    ../ext/Time/HiRes/t/HiRes.t.............FAILED 12-38
    ../ext/XS/APItest/t/my_cxt.t............FAILED ??
    ../ext/threads/shared/t/av_refs.t.......FAILED 2-14
    ../ext/threads/shared/t/av_simple.t.....FAILED 2-44
    ../ext/threads/shared/t/blessed.t.......FAILED 2-37
    ../ext/threads/shared/t/cond.t..........FAILED 2-82
    ../ext/threads/shared/t/hv_refs.t.......FAILED 2-20
    ../ext/threads/shared/t/hv_simple.t.....FAILED 2-16
    ../ext/threads/shared/t/shared_attr.t...FAILED 2-101
    ../ext/threads/shared/t/sv_refs.t.......FAILED 2-11
    ../ext/threads/shared/t/sv_simple.t.....FAILED 2-11
    ../ext/threads/shared/t/wait.t..........FAILED 6-103
    ../ext/threads/t/blocks.t...............FAILED 1-5
    ../ext/threads/t/context.t..............FAILED 1-31
    ../ext/threads/t/end.t..................FAILED 1-6
    ../ext/threads/t/exit.t.................FAILED 9-18
    ../ext/threads/t/free.t.................FAILED 1-29
    ../ext/threads/t/free2.t................FAILED 1-78
    ../ext/threads/t/join.t.................FAILED 1-20
    ../ext/threads/t/kill.t.................FAILED 1-19
    ../ext/threads/t/problems.t.............FAILED 2-15
    ../ext/threads/t/state.t................FAILED 1-59
    ../ext/threads/t/thread.t...............FAILED 4-31
    ../lib/Net/Ping/t/190_alarm.t...........FAILED 5-6
    ../lib/Test/Simple/t/diag.t.............FAILED ??
    ../lib/Test/Simple/t/overload_threads.t.FAILED ??
    ../lib/Test/Simple/t/sort_bug.t.........FAILED ??
    ../lib/Test/Simple/t/threads.t..........FAILED ??
    ../lib/Thread/Queue.t...................FAILED ??
    ../lib/warnings.t.......................FAILED 288
    ../t/io/pipe.t..........................FAILED 9-24
    ../t/op/alarm.t.........................FAILED ??
    ../t/op/getpid.t........................FAILED ??
    ../t/op/magic.t.........................FAILED 3-5
Inconsistent test results (between TEST and harness):
    ../lib/vars.t...........................FAILED--expected 27 tests, saw =
16

[stdio] -DDEBUGGING -Duseithreads -Duselongdouble
[stdio] -DDEBUGGING -Duseithreads -Dusemorebits
    ../ext/B/t/concise-xs.t.................FAILED 812-1594
    ../ext/Compress/Zlib/t/14gzopen.t.......FAILED 139-217
    ../ext/DB_File/t/db-btree.t.............FAILED ??
    ../ext/DB_File/t/db-hash.t..............FAILED ??
    ../ext/DB_File/t/db-recno.t.............FAILED ??
    ../ext/Hash/Util/FieldHash/t/03_class.t.FAILED 3-7
    ../ext/Hash/Util/FieldHash/t/04_thread.tFAILED 7-30
    ../ext/IO/t/IO.t........................FAILED 5-18
    ../ext/IO/t/io_multihomed.t.............FAILED ??
    ../ext/IO/t/io_sock.t...................FAILED ??
    ../ext/IO/t/io_udp.t....................FAILED ??
    ../ext/IO/t/io_unix.t...................FAILED ??
    ../ext/IO/t/io_xs.t.....................FAILED ??
    ../ext/NDBM_File/t/ndbm.t...............FAILED ??
    ../ext/POSIX/t/posix.t..................FAILED ??
    ../ext/POSIX/t/sysconf.t................FAILED 1-87
    ../ext/Storable/t/threads.t.............FAILED ??
    ../ext/Sys/Syslog/t/00-load.t...........FAILED 1
    ../ext/Sys/Syslog/t/constants.t.........FAILED 1-3 5 7 9 11
                                                   13 15 17 19 21
                                                   23 25 27 29 31
                                                   33 35 37 39 41
                                                   43 45 47 49 51
                                                   53 55 57 59 61
                                                   63 65 67 69 71
                                                   73 75 77 79 81
                                                   83 85 87
    ../ext/Sys/Syslog/t/syslog.t............FAILED 1 3-159
    ../ext/XS/APItest/t/my_cxt.t............FAILED ??
    ../ext/threads/shared/t/av_refs.t.......FAILED 2-14
    ../ext/threads/shared/t/av_simple.t.....FAILED 2-44
    ../ext/threads/shared/t/blessed.t.......FAILED 2-37
    ../ext/threads/shared/t/cond.t..........FAILED 2-82
    ../ext/threads/shared/t/hv_refs.t.......FAILED 2-20
    ../ext/threads/shared/t/hv_simple.t.....FAILED 2-16
    ../ext/threads/shared/t/no_share.t......FAILED 4-6
    ../ext/threads/shared/t/shared_attr.t...FAILED 2-101
    ../ext/threads/shared/t/sv_refs.t.......FAILED 2-11
    ../ext/threads/shared/t/sv_simple.t.....FAILED 2-11
    ../ext/threads/shared/t/wait.t..........FAILED 6-103
    ../ext/threads/t/basic.t................FAILED 3-33
    ../ext/threads/t/blocks.t...............FAILED 1-5
    ../ext/threads/t/context.t..............FAILED 1-31
    ../ext/threads/t/end.t..................FAILED 1-6
    ../ext/threads/t/err.t..................FAILED 2-10
    ../ext/threads/t/exit.t.................FAILED 2-18
    ../ext/threads/t/free.t.................FAILED 1-29
    ../ext/threads/t/free2.t................FAILED 1-78
    ../ext/threads/t/join.t.................FAILED 1-20
    ../ext/threads/t/kill.t.................FAILED ??
    ../ext/threads/t/libc.t.................FAILED 2-11
    ../ext/threads/t/list.t.................FAILED 3-15
    ../ext/threads/t/problems.t.............FAILED 2-15
    ../ext/threads/t/stack.t................FAILED 5-18
    ../ext/threads/t/state.t................FAILED 1-59
    ../ext/threads/t/stress_cv.t............FAILED 3-63
    ../ext/threads/t/stress_re.t............FAILED 2-31
    ../ext/threads/t/stress_string.t........FAILED 3-63
    ../ext/threads/t/thread.t...............FAILED 2-31
    ../lib/Locale/Codes/t/all.t.............FAILED ??
    ../lib/Net/Ping/t/100_load.t............FAILED 1
    ../lib/Net/Ping/t/110_icmp_inst.t.......FAILED ??
    ../lib/Net/Ping/t/120_udp_inst.t........FAILED ??
    ../lib/Net/Ping/t/130_tcp_inst.t........FAILED ??
    ../lib/Net/Ping/t/140_stream_inst.t.....FAILED ??
    ../lib/Net/Ping/t/150_syn_inst.t........FAILED ??
    ../lib/Net/Ping/t/190_alarm.t...........FAILED ??
    ../lib/Net/Ping/t/500_ping_icmp.t.......FAILED ??
    ../lib/Net/Ping/t/510_ping_udp.t........FAILED ??
    ../lib/Net/t/ftp.t......................FAILED ??
    ../lib/Net/t/nntp.t.....................FAILED ??
    ../lib/Net/t/require.t..................FAILED 5-9
    ../lib/Net/t/smtp.t.....................FAILED ??
    ../lib/Test/Simple/t/diag.t.............FAILED ??
    ../lib/Test/Simple/t/overload_threads.t.FAILED ??
    ../lib/Test/Simple/t/sort_bug.t.........FAILED ??
    ../lib/Test/Simple/t/threads.t..........FAILED ??
    ../lib/Thread/Queue.t...................FAILED ??
    ../t/io/dup.t...........................FAILED 15-26
    ../t/io/open.t..........................FAILED 93
    ../t/lib/1_compile.t....................FAILED 3
    ../t/lib/proxy_constant_subs.t..........FAILED 5-8
    ../t/op/getpid.t........................FAILED ??
    ../t/op/taint.t.........................FAILED ??
    ../t/op/threads.t.......................FAILED 1-6
Inconsistent test results (between TEST and harness):
    ../ext/IO/Compress/Zlib/t/105oneshot-deflate.tFAILED--expected 970 test=
s, saw 173
    ../ext/IO/Compress/Zlib/t/100generic-rawdeflate.tFAILED--expected 641 t=
ests, saw 81
    ../ext/IO/Compress/Zlib/t/105oneshot-zip.tFAILED--expected 970 tests, s=
aw 173
    ../ext/IO/Compress/Zlib/t/105oneshot-gzip.tFAILED--expected 970 tests, =
saw 173
    ../ext/IO/Compress/Zlib/t/105oneshot-rawdeflate.tFAILED--expected 970 t=
ests, saw 173
    ../ext/IO/Compress/Zlib/t/100generic-zip.tFAILED--expected 641 tests, s=
aw 81
    ../ext/IO/Compress/Zlib/t/100generic-gzip.tFAILED--expected 641 tests, =
saw 81
    ../ext/IO/Compress/Zlib/t/100generic-deflate.tFAILED--expected 641 test=
s, saw 81

[perlio] -DDEBUGGING -Duseithreads -Duselongdouble
[perlio] -DDEBUGGING -Duseithreads -Dusemorebits
    ../ext/B/t/concise-xs.t.................FAILED 812-1594
    ../ext/DB_File/t/db-btree.t.............FAILED ??
    ../ext/DB_File/t/db-hash.t..............FAILED ??
    ../ext/DB_File/t/db-recno.t.............FAILED ??
    ../ext/IO/t/IO.t........................FAILED 5-18
    ../ext/IO/t/io_multihomed.t.............FAILED ??
    ../ext/IO/t/io_sock.t...................FAILED ??
    ../ext/IO/t/io_udp.t....................FAILED ??
    ../ext/IO/t/io_unix.t...................FAILED ??
    ../ext/IO/t/io_xs.t.....................FAILED ??
    ../ext/NDBM_File/t/ndbm.t...............FAILED ??
    ../ext/POSIX/t/posix.t..................FAILED ??
    ../ext/POSIX/t/sysconf.t................FAILED 1-87
    ../ext/Storable/t/threads.t.............FAILED ??
    ../ext/Sys/Syslog/t/00-load.t...........FAILED 1
    ../ext/Sys/Syslog/t/constants.t.........FAILED 1-3 5 7 9 11 13
                                                   15 17 19 21 23
                                                   25 27 29 31 33
                                                   35 37 39 41 43
                                                   45 47 49 51 53
                                                   55 57 59 61 63
                                                   65 67 69 71 73
                                                   75 77 79 81 83
                                                   85 87
    ../ext/Sys/Syslog/t/syslog.t............FAILED 1 3-159
    ../ext/XS/APItest/t/my_cxt.t............FAILED ??
    ../ext/threads/shared/t/av_refs.t.......FAILED 2-14
    ../ext/threads/shared/t/av_simple.t.....FAILED 2-44
    ../ext/threads/shared/t/blessed.t.......FAILED 2-37
    ../ext/threads/shared/t/cond.t..........FAILED 2-82
    ../ext/threads/shared/t/hv_refs.t.......FAILED 2-20
    ../ext/threads/shared/t/hv_simple.t.....FAILED 2-16
    ../ext/threads/shared/t/shared_attr.t...FAILED 2-101
    ../ext/threads/shared/t/sv_refs.t.......FAILED 2-11
    ../ext/threads/shared/t/sv_simple.t.....FAILED 2-11
    ../ext/threads/shared/t/wait.t..........FAILED 6-103
    ../ext/threads/t/blocks.t...............FAILED 1-5
    ../ext/threads/t/context.t..............FAILED 1-31
    ../ext/threads/t/end.t..................FAILED 1-6
    ../ext/threads/t/exit.t.................FAILED 9-18
    ../ext/threads/t/free.t.................FAILED 1-29
    ../ext/threads/t/free2.t................FAILED 1-78
    ../ext/threads/t/join.t.................FAILED 1-20
    ../ext/threads/t/kill.t.................FAILED 1-19
    ../ext/threads/t/problems.t.............FAILED 2-15
    ../ext/threads/t/state.t................FAILED 1-59
    ../ext/threads/t/thread.t...............FAILED 4-31
    ../lib/Locale/Codes/t/all.t.............FAILED ??
    ../lib/Net/Ping/t/100_load.t............FAILED 1
    ../lib/Net/Ping/t/110_icmp_inst.t.......FAILED ??
    ../lib/Net/Ping/t/120_udp_inst.t........FAILED ??
    ../lib/Net/Ping/t/130_tcp_inst.t........FAILED ??
    ../lib/Net/Ping/t/140_stream_inst.t.....FAILED ??
    ../lib/Net/Ping/t/150_syn_inst.t........FAILED ??
    ../lib/Net/Ping/t/190_alarm.t...........FAILED ??
    ../lib/Net/Ping/t/500_ping_icmp.t.......FAILED ??
    ../lib/Net/Ping/t/510_ping_udp.t........FAILED ??
    ../lib/Net/t/ftp.t......................FAILED ??
    ../lib/Net/t/nntp.t.....................FAILED ??
    ../lib/Net/t/require.t..................FAILED 5-9
    ../lib/Net/t/smtp.t.....................FAILED ??
    ../lib/Test/Simple/t/diag.t.............FAILED ??
    ../lib/Test/Simple/t/overload_threads.t.FAILED ??
    ../lib/Test/Simple/t/sort_bug.t.........FAILED ??
    ../lib/Test/Simple/t/threads.t..........FAILED ??
    ../lib/Thread/Queue.t...................FAILED ??
    ../t/lib/1_compile.t....................FAILED 3
    ../t/lib/proxy_constant_subs.t..........FAILED 5-8
    ../t/op/getpid.t........................FAILED ??
    ../t/op/taint.t.........................FAILED ??

[stdio] -Duseithreads -Dusemorebits
    ../ext/Compress/Zlib/t/14gzopen.t.......FAILED 139-217
    ../ext/Hash/Util/FieldHash/t/03_class.t.FAILED 3-7
    ../ext/Hash/Util/FieldHash/t/04_thread.tFAILED 7-30
    ../ext/IO/t/io_pipe.t...................FAILED 9-10
    ../ext/POSIX/t/posix.t..................FAILED 11-66
    ../ext/POSIX/t/sigaction.t..............FAILED 25-31
    ../ext/Socket/t/socketpair.t............FAILED 36-45
    ../ext/Storable/t/threads.t.............FAILED ??
    ../ext/Time/HiRes/t/HiRes.t.............FAILED 12-38
    ../ext/XS/APItest/t/my_cxt.t............FAILED ??
    ../ext/threads/shared/t/av_refs.t.......FAILED 2-14
    ../ext/threads/shared/t/av_simple.t.....FAILED 2-44
    ../ext/threads/shared/t/blessed.t.......FAILED 2-37
    ../ext/threads/shared/t/cond.t..........FAILED 2-82
    ../ext/threads/shared/t/hv_refs.t.......FAILED 2-20
    ../ext/threads/shared/t/hv_simple.t.....FAILED 2-16
    ../ext/threads/shared/t/no_share.t......FAILED 4-6
    ../ext/threads/shared/t/shared_attr.t...FAILED 2-101
    ../ext/threads/shared/t/sv_refs.t.......FAILED 2-11
    ../ext/threads/shared/t/sv_simple.t.....FAILED 2-11
    ../ext/threads/shared/t/wait.t..........FAILED 6-103
    ../ext/threads/t/basic.t................FAILED 3-33
    ../ext/threads/t/blocks.t...............FAILED 1-5
    ../ext/threads/t/context.t..............FAILED 1-31
    ../ext/threads/t/end.t..................FAILED 1-6
    ../ext/threads/t/err.t..................FAILED 2-10
    ../ext/threads/t/exit.t.................FAILED 2-18
    ../ext/threads/t/free.t.................FAILED 1-29
    ../ext/threads/t/free2.t................FAILED 1-78
    ../ext/threads/t/join.t.................FAILED 1-20
    ../ext/threads/t/kill.t.................FAILED ??
    ../ext/threads/t/libc.t.................FAILED 2-11
    ../ext/threads/t/list.t.................FAILED 3-15
    ../ext/threads/t/problems.t.............FAILED 2-15
    ../ext/threads/t/stack.t................FAILED 5-18
    ../ext/threads/t/state.t................FAILED 1-59
    ../ext/threads/t/stress_cv.t............FAILED 3-63
    ../ext/threads/t/stress_re.t............FAILED 2-31
    ../ext/threads/t/stress_string.t........FAILED 3-63
    ../ext/threads/t/thread.t...............FAILED 2-31
    ../lib/Net/Ping/t/190_alarm.t...........FAILED 5-6
    ../lib/Test/Simple/t/diag.t.............FAILED ??
    ../lib/Test/Simple/t/overload_threads.t.FAILED ??
    ../lib/Test/Simple/t/sort_bug.t.........FAILED ??
    ../lib/Test/Simple/t/threads.t..........FAILED ??
    ../lib/Thread/Queue.t...................FAILED ??
    ../lib/warnings.t.......................FAILED 288
    ../t/io/dup.t...........................FAILED 15-26
    ../t/io/open.t..........................FAILED 93
    ../t/io/pipe.t..........................FAILED 9-24
    ../t/op/alarm.t.........................FAILED ??
    ../t/op/getpid.t........................FAILED ??
    ../t/op/magic.t.........................FAILED 3-5
    ../t/op/threads.t.......................FAILED 1-6
Inconsistent test results (between TEST and harness):
    ../ext/IO/Compress/Zlib/t/105oneshot-deflate.tFAILED--expected 970 test=
s, saw 173
    ../ext/IO/Compress/Zlib/t/100generic-rawdeflate.tFAILED--expected 641 t=
ests, saw 81
    ../ext/IO/Compress/Zlib/t/105oneshot-zip.tFAILED--expected 970 tests, s=
aw 173
    ../ext/IO/Compress/Zlib/t/105oneshot-gzip.tFAILED--expected 970 tests, =
saw 173
    ../ext/IO/Compress/Zlib/t/105oneshot-rawdeflate.tFAILED--expected 970 t=
ests, saw 173
    ../ext/IO/Compress/Zlib/t/100generic-zip.tFAILED--expected 641 tests, s=
aw 81
    ../ext/IO/Compress/Zlib/t/100generic-gzip.tFAILED--expected 641 tests, =
saw 81
    ../ext/IO/Compress/Zlib/t/100generic-deflate.tFAILED--expected 641 test=
s, saw 81

--=20
Report by Test::Smoke v1.19_83 build 980 running on perl 5.8.8
(Reporter v0.026 / Smoker v0.029)

0
steve
3/14/2007 7:45:00 AM
perl.perl5.porters 47869 articles. 1 followers. Follow

0 Replies
601 Views

Similar Articles

[PageSpeed] 34

Reply:

Similar Artilces:

Smoke [5.9.5] 30578 FAIL(F) linux 2.6.19-1.2288.2.4.fc5 [fedora] (i686/1 cpu)
Automated smoke report for 5.9.5 patch 30578 kirk.peters.homeunix.org: Intel(R) Celeron(R) CPU 2.00GHz (GenuineIntel 199= 4MHz) (i686/1 cpu) on linux - 2.6.19-1.2288.2.4.fc5 [fedora] using cc version 4.1.1 20070105 (Red Hat 4.1.1-51) smoketime 18 hours 33 minutes (average 1 hour 9 minutes) Summary: FAIL(F) O =3D OK F =3D Failure(s), extended report at the bottom X =3D Failure(s) under TEST but not under harness ? =3D still running or test results not (yet) available Build failures during: - =3D unknown or N/A c =3D Configure, m =3D make, M =3D make ...

Smoke [5.9.5] 30594 FAIL(XF) linux 2.6.19-1.2288.2.4.fc5 [fedora] (i686/1 cpu)
Automated smoke report for 5.9.5 patch 30594 kirk.peters.homeunix.org: Intel(R) Celeron(R) CPU 2.00GHz (GenuineIntel 199= 4MHz) (i686/1 cpu) on linux - 2.6.19-1.2288.2.4.fc5 [fedora] using icc -gcc-name=3D/usr/local/bin/g++-4.0 version smoketime 14 hours 9 minutes (average 53 minutes 5 seconds) Summary: FAIL(XF) O =3D OK F =3D Failure(s), extended report at the bottom X =3D Failure(s) under TEST but not under harness ? =3D still running or test results not (yet) available Build failures during: - =3D unknown or N/A c =3D Configure, m =3D make, M =3D...

Smoke [5.9.5] 30660 FAIL(XF) linux 2.6.19-1.2288.2.4.fc5 [fedora] (i686/1 cpu)
Automated smoke report for 5.9.5 patch 30660 kirk.peters.homeunix.org: Intel(R) Celeron(R) CPU 2.00GHz (GenuineIntel 199= 4MHz) (i686/1 cpu) on linux - 2.6.19-1.2288.2.4.fc5 [fedora] using cc version 4.1.1 20070105 (Red Hat 4.1.1-51) smoketime 1 day 14 hours 18 minutes (average 2 hours 23 minutes) Summary: FAIL(XF) O =3D OK F =3D Failure(s), extended report at the bottom X =3D Failure(s) under TEST but not under harness ? =3D still running or test results not (yet) available Build failures during: - =3D unknown or N/A c =3D Configure, m =3D make, M ...

Smoke [5.9.5] 30493 FAIL(M) linux 2.6.19-1.2288.2.1.fc5 [fedora] (i686/1 cpu)
Automated smoke report for 5.9.5 patch 30493 kirk.peters.homeunix.org: Intel(R) Celeron(R) CPU 2.00GHz (GenuineIntel 199= 4MHz) (i686/1 cpu) on linux - 2.6.19-1.2288.2.1.fc5 [fedora] using cc version 4.1.1 20070105 (Red Hat 4.1.1-51) smoketime 1 hour 23 minutes (average 5 minutes 15 seconds) Summary: FAIL(M) O =3D OK F =3D Failure(s), extended report at the bottom X =3D Failure(s) under TEST but not under harness ? =3D still running or test results not (yet) available Build failures during: - =3D unknown or N/A c =3D Configure, m =3D make, M =3D mak...

Smoke [5.9.5] 30516 FAIL(c) linux 2.6.19-1.2288.2.1.fc5 [fedora] (i686/1 cpu)
Automated smoke report for 5.9.5 patch 30516 kirk.peters.homeunix.org: Intel(R) Celeron(R) CPU 2.00GHz (GenuineIntel 199= 4MHz) (i686/1 cpu) on linux - 2.6.19-1.2288.2.1.fc5 [fedora] using ? unknown cc version=20 smoketime 26 seconds (average 1.625 seconds) Summary: FAIL(c) O =3D OK F =3D Failure(s), extended report at the bottom X =3D Failure(s) under TEST but not under harness ? =3D still running or test results not (yet) available Build failures during: - =3D unknown or N/A c =3D Configure, m =3D make, M =3D make (after miniperl), t =3D make test...

Smoke [5.9.5] 30521 FAIL(XF) linux 2.6.19-1.2288.2.1.fc5 [fedora] (i686/1 cpu)
Automated smoke report for 5.9.5 patch 30521 kirk.peters.homeunix.org: Intel(R) Celeron(R) CPU 2.00GHz (GenuineIntel 199= 4MHz) (i686/1 cpu) on linux - 2.6.19-1.2288.2.1.fc5 [fedora] using cc version 4.1.1 20070105 (Red Hat 4.1.1-51) smoketime 18 hours 19 minutes (average 1 hour 8 minutes) Summary: FAIL(XF) O =3D OK F =3D Failure(s), extended report at the bottom X =3D Failure(s) under TEST but not under harness ? =3D still running or test results not (yet) available Build failures during: - =3D unknown or N/A c =3D Configure, m =3D make, M =3D make...

Smoke [5.9.5] 30344 FAIL(F) linux 2.6.19-1.2288.fc5 [fedora] (i686/1 cpu)
Automated smoke report for 5.9.5 patch 30344 kirk.peters.homeunix.org: Intel(R) Celeron(R) CPU 2.00GHz (GenuineIntel 199= 4MHz) (i686/1 cpu) on linux - 2.6.19-1.2288.fc5 [fedora] using cc version 4.1.1 20070105 (Red Hat 4.1.1-51) smoketime 17 hours 48 minutes (average 1 hour 6 minutes) Summary: FAIL(F) O =3D OK F =3D Failure(s), extended report at the bottom X =3D Failure(s) under TEST but not under harness ? =3D still running or test results not (yet) available Build failures during: - =3D unknown or N/A c =3D Configure, m =3D make, M =3D make (aft...

Smoke [5.9.5] 30352 FAIL(F) linux 2.6.19-1.2288.fc5 [fedora] (i686/1 cpu)
Automated smoke report for 5.9.5 patch 30352 kirk.peters.homeunix.org: Intel(R) Celeron(R) CPU 2.00GHz (GenuineIntel 199= 4MHz) (i686/1 cpu) on linux - 2.6.19-1.2288.fc5 [fedora] using cc version 4.1.1 20070105 (Red Hat 4.1.1-51) smoketime 19 hours 14 minutes (average 1 hour 12 minutes) Summary: FAIL(F) O =3D OK F =3D Failure(s), extended report at the bottom X =3D Failure(s) under TEST but not under harness ? =3D still running or test results not (yet) available Build failures during: - =3D unknown or N/A c =3D Configure, m =3D make, M =3D make (af...

Smoke [5.9.5] 30486 FAIL(F) linux 2.6.19-1.2288.fc5 [fedora] (i686/1 cpu)
Automated smoke report for 5.9.5 patch 30486 kirk.peters.homeunix.org: Intel(R) Celeron(R) CPU 2.00GHz (GenuineIntel 199= 4MHz) (i686/1 cpu) on linux - 2.6.19-1.2288.fc5 [fedora] using icc -gcc-name=3D/usr/local/bin/g++-4.0 version smoketime 13 hours 59 minutes (average 52 minutes 29 seconds) Summary: FAIL(F) O =3D OK F =3D Failure(s), extended report at the bottom X =3D Failure(s) under TEST but not under harness ? =3D still running or test results not (yet) available Build failures during: - =3D unknown or N/A c =3D Configure, m =3D make, M =3D ma...

Smoke [5.9.5] 30335 FAIL(F) linux 2.6.19-1.2288.fc5 [fedora] (i686/1 cpu)
Automated smoke report for 5.9.5 patch 30335 kirk.peters.homeunix.org: Intel(R) Celeron(R) CPU 2.00GHz (GenuineIntel 199= 4MHz) (i686/1 cpu) on linux - 2.6.19-1.2288.fc5 [fedora] using cc version 4.1.1 20070105 (Red Hat 4.1.1-51) smoketime 17 hours 52 minutes (average 1 hour 7 minutes) Summary: FAIL(F) O =3D OK F =3D Failure(s), extended report at the bottom X =3D Failure(s) under TEST but not under harness ? =3D still running or test results not (yet) available Build failures during: - =3D unknown or N/A c =3D Configure, m =3D make, M =3D make (aft...

Smoke [5.9.5] 30464 FAIL(XF) linux 2.6.19-1.2288.fc5 [fedora] (i686/1 cpu)
Automated smoke report for 5.9.5 patch 30464 kirk.peters.homeunix.org: Intel(R) Celeron(R) CPU 2.00GHz (GenuineIntel 199= 4MHz) (i686/1 cpu) on linux - 2.6.19-1.2288.fc5 [fedora] using cc version 4.1.1 20070105 (Red Hat 4.1.1-51) smoketime 18 hours 16 minutes (average 1 hour 8 minutes) Summary: FAIL(XF) O =3D OK F =3D Failure(s), extended report at the bottom X =3D Failure(s) under TEST but not under harness ? =3D still running or test results not (yet) available Build failures during: - =3D unknown or N/A c =3D Configure, m =3D make, M =3D make (af...

Smoke [5.9.5] 30327 FAIL(XF) linux 2.6.19-1.2288.fc5 [fedora] (i686/1 cpu)
Automated smoke report for 5.9.5 patch 30327 kirk.peters.homeunix.org: Intel(R) Celeron(R) CPU 2.00GHz (GenuineIntel 199= 4MHz) (i686/1 cpu) on linux - 2.6.19-1.2288.fc5 [fedora] using cc version 4.1.1 20070105 (Red Hat 4.1.1-51) smoketime 18 hours 4 minutes (average 1 hour 7 minutes) Summary: FAIL(XF) O =3D OK F =3D Failure(s), extended report at the bottom X =3D Failure(s) under TEST but not under harness ? =3D still running or test results not (yet) available Build failures during: - =3D unknown or N/A c =3D Configure, m =3D make, M =3D make (after miniperl), t =3D make test-p= rep 30327 Configuration (common) -Dgccansipedantic ----------- --------------------------------------------------------- O O O O O O=20 O O O O O O -Duse64bitint O O O F F F -Duselongdouble O O X F F F -Dusemorebits O O O O O O -Duseithreads O O O O O O -Duseithreads -Duse64bitint O O O F F F -Duseithreads -Duselongdouble O O O F F F -Duseithreads -Dusemorebits | | | | | +- LC_ALL =3D en_US.utf8 -DDEBUGGING | | | | +--- PERLIO =3D perlio -DDEBUGGING | | | +----- PERLIO =3D stdio -DDEBUGGING | | +------- LC_ALL =3D en_US.utf8 | +--------- PERLIO =3D perlio +----------- PERLIO =3D stdio Locally applied patches: DEVEL SMOKE30327 Failures: (common-args) -Dgccansipedantic [stdio/perlio/en_US.utf8] -DDEBUGGING -Duselongdouble [stdio/perlio/en_US.utf8] -DDEBUGGING -Dusemorebits [stdio/perlio/en_US.utf8] -DDEBUGGING -...

Smoke [5.9.5] 29485 FAIL(F) linux 2.6.18-1.2239.fc5 [fedora] (i686/1 cpu)
Automated smoke report for 5.9.5 patch 29485 kirk.peters.homeunix.org: Intel(R) Celeron(R) CPU 2.00GHz (GenuineIntel 199= 4MHz) (i686/1 cpu) on linux - 2.6.18-1.2239.fc5 [fedora] using cc version 4.1.1 20060525 (Red Hat 4.1.1-1) smoketime 1 day 9 hours 21 minutes (average 2 hours 5 minutes) Summary: FAIL(F) O =3D OK F =3D Failure(s), extended report at the bottom X =3D Failure(s) under TEST but not under harness ? =3D still running or test results not (yet) available Build failures during: - =3D unknown or N/A c =3D Configure, m =3D make, M =3D make...

Smoke [5.9.5] 29511 FAIL(F) linux 2.6.18-1.2239.fc5 [fedora] (i686/1 cpu)
Automated smoke report for 5.9.5 patch 29511 kirk.peters.homeunix.org: Intel(R) Celeron(R) CPU 2.00GHz (GenuineIntel 199= 4MHz) (i686/1 cpu) on linux - 2.6.18-1.2239.fc5 [fedora] using cc version 4.1.1 20060525 (Red Hat 4.1.1-1) smoketime 18 hours 21 minutes (average 1 hour 8 minutes) Summary: FAIL(F) O =3D OK F =3D Failure(s), extended report at the bottom X =3D Failure(s) under TEST but not under harness ? =3D still running or test results not (yet) available Build failures during: - =3D unknown or N/A c =3D Configure, m =3D make, M =3D make (afte...

Smoke [5.9.5] 29431 FAIL(F) linux 2.6.18-1.2239.fc5 [fedora] (i686/1 cpu)
Automated smoke report for 5.9.5 patch 29431 kirk.peters.homeunix.org: Intel(R) Celeron(R) CPU 2.00GHz (GenuineIntel 199= 4MHz) (i686/1 cpu) on linux - 2.6.18-1.2239.fc5 [fedora] using cc version 4.1.1 20060525 (Red Hat 4.1.1-1) smoketime 1 day 6 hours 10 minutes (average 1 hour 53 minutes) Summary: FAIL(F) O =3D OK F =3D Failure(s), extended report at the bottom X =3D Failure(s) under TEST but not under harness ? =3D still running or test results not (yet) available Build failures during: - =3D unknown or N/A c =3D Configure, m =3D make, M =3D make...

Smoke [5.9.5] 30888 FAIL(F) linux 2.6.20-1.2307.fc5 [fedora] (i686/1 cpu)
Automated smoke report for 5.9.5 patch 30888 kirk.peters.homeunix.org: Intel(R) Celeron(R) CPU 2.00GHz (GenuineIntel 199= 4MHz) (i686/1 cpu) on linux - 2.6.20-1.2307.fc5 [fedora] using suncc version smoketime 19 hours 33 minutes (average 1 hour 13 minutes) Summary: FAIL(F) O =3D OK F =3D Failure(s), extended report at the bottom X =3D Failure(s) under TEST but not under harness ? =3D still running or test results not (yet) available Build failures during: - =3D unknown or N/A c =3D Configure, m =3D make, M =3D make (after miniperl), t =3D make test-...

Smoke [5.9.5] 29243 FAIL(F) linux 2.6.18-1.2200.fc5 [fedora] (i686/1 cpu)
Automated smoke report for 5.9.5 patch 29243 kirk.peters.homeunix.org: Intel(R) Celeron(R) CPU 2.00GHz (GenuineIntel 199= 4MHz) (i686/1 cpu) on linux - 2.6.18-1.2200.fc5 [fedora] using cc version 4.1.1 20060525 (Red Hat 4.1.1-1) smoketime 17 hours 13 minutes (average 1 hour 4 minutes) Summary: FAIL(F) O =3D OK F =3D Failure(s), extended report at the bottom X =3D Failure(s) under TEST but not under harness ? =3D still running or test results not (yet) available Build failures during: - =3D unknown or N/A c =3D Configure, m =3D make, M =3D make (afte...

Smoke [5.9.5] 31414 FAIL(F) linux 2.6.20-1.2316.fc5 [fedora] (i686/1 cpu)
Automated smoke report for 5.9.5 patch 31414 kirk.peters.homeunix.org: Intel(R) Celeron(R) CPU 2.00GHz (GenuineIntel 199= 4MHz) (i686/1 cpu) on linux - 2.6.20-1.2316.fc5 [fedora] using cc version 4.1.1 20070105 (Red Hat 4.1.1-51) smoketime 20 hours 47 minutes (average 1 hour 17 minutes) Summary: FAIL(F) O =3D OK F =3D Failure(s), extended report at the bottom X =3D Failure(s) under TEST but not under harness ? =3D still running or test results not (yet) available Build failures during: - =3D unknown or N/A c =3D Configure, m =3D make, M =3D make (af...

Smoke [5.9.5] 29383 FAIL(F) linux 2.6.18-1.2239.fc5 [fedora] (i686/1 cpu)
Automated smoke report for 5.9.5 patch 29383 kirk.peters.homeunix.org: Intel(R) Celeron(R) CPU 2.00GHz (GenuineIntel 199= 4MHz) (i686/1 cpu) on linux - 2.6.18-1.2239.fc5 [fedora] using cc version 4.1.1 20060525 (Red Hat 4.1.1-1) smoketime 21 hours 21 minutes (average 1 hour 20 minutes) Summary: FAIL(F) O =3D OK F =3D Failure(s), extended report at the bottom X =3D Failure(s) under TEST but not under harness ? =3D still running or test results not (yet) available Build failures during: - =3D unknown or N/A c =3D Configure, m =3D make, M =3D make (aft...

Smoke [5.9.5] 29734 FAIL(F) linux 2.6.18-1.2257.fc5 [fedora] (i686/1 cpu)
Automated smoke report for 5.9.5 patch 29734 kirk.peters.homeunix.org: Intel(R) Celeron(R) CPU 2.00GHz (GenuineIntel 199= 4MHz) (i686/1 cpu) on linux - 2.6.18-1.2257.fc5 [fedora] using icc -gcc-name=3D/usr/local/bin/g++-4.0 version smoketime 13 hours 52 minutes (average 52 minutes) Summary: FAIL(F) O =3D OK F =3D Failure(s), extended report at the bottom X =3D Failure(s) under TEST but not under harness ? =3D still running or test results not (yet) available Build failures during: - =3D unknown or N/A c =3D Configure, m =3D make, M =3D make (after m...

Smoke [5.9.5] 30774 FAIL(F) linux 2.6.20-1.2307.fc5 [fedora] (i686/1 cpu)
Automated smoke report for 5.9.5 patch 30774 kirk.peters.homeunix.org: Intel(R) Celeron(R) CPU 2.00GHz (GenuineIntel 199= 4MHz) (i686/1 cpu) on linux - 2.6.20-1.2307.fc5 [fedora] using suncc version smoketime 15 hours 2 minutes (average 56 minutes 25 seconds) Summary: FAIL(F) O =3D OK F =3D Failure(s), extended report at the bottom X =3D Failure(s) under TEST but not under harness ? =3D still running or test results not (yet) available Build failures during: - =3D unknown or N/A c =3D Configure, m =3D make, M =3D make (after miniperl), t =3D make te...

Smoke [5.9.5] 30255 FAIL(F) linux 2.6.18-1.2257.fc5 [fedora] (i686/1 cpu)
Automated smoke report for 5.9.5 patch 30255 kirk.peters.homeunix.org: Intel(R) Celeron(R) CPU 2.00GHz (GenuineIntel 199= 4MHz) (i686/1 cpu) on linux - 2.6.18-1.2257.fc5 [fedora] using icc -gcc-name=3D/usr/local/bin/g++-4.0 version smoketime 14 hours 18 minutes (average 53 minutes 40 seconds) Summary: FAIL(F) O =3D OK F =3D Failure(s), extended report at the bottom X =3D Failure(s) under TEST but not under harness ? =3D still running or test results not (yet) available Build failures during: - =3D unknown or N/A c =3D Configure, m =3D make, M =3D ma...

Smoke [5.9.5] 31388 FAIL(F) linux 2.6.20-1.2316.fc5 [fedora] (i686/1 cpu)
Automated smoke report for 5.9.5 patch 31388 kirk.peters.homeunix.org: Intel(R) Celeron(R) CPU 2.00GHz (GenuineIntel 199= 4MHz) (i686/1 cpu) on linux - 2.6.20-1.2316.fc5 [fedora] using cc version 4.1.1 20070105 (Red Hat 4.1.1-51) smoketime 20 hours 43 minutes (average 1 hour 17 minutes) Summary: FAIL(F) O =3D OK F =3D Failure(s), extended report at the bottom X =3D Failure(s) under TEST but not under harness ? =3D still running or test results not (yet) available Build failures during: - =3D unknown or N/A c =3D Configure, m =3D make, M =3D make (af...

Smoke [5.9.5] 30221 FAIL(F) linux 2.6.18-1.2257.fc5 [fedora] (i686/1 cpu)
Automated smoke report for 5.9.5 patch 30221 kirk.peters.homeunix.org: Intel(R) Celeron(R) CPU 2.00GHz (GenuineIntel 199= 4MHz) (i686/1 cpu) on linux - 2.6.18-1.2257.fc5 [fedora] using cc version 4.1.1 20070105 (Red Hat 4.1.1-51) smoketime 18 hours 10 minutes (average 1 hour 8 minutes) Summary: FAIL(F) O =3D OK F =3D Failure(s), extended report at the bottom X =3D Failure(s) under TEST but not under harness ? =3D still running or test results not (yet) available Build failures during: - =3D unknown or N/A c =3D Configure, m =3D make, M =3D make (aft...

Web resources about - Smoke [5.9.5] 30562 FAIL(F) linux 2.6.19-1.2288.2.4.fc5 [fedora] (i686/1 cpu) - perl.perl5.porters

Fedora (operating system) - Wikipedia, the free encyclopedia
It was codenamed Yarrow . Fedora Core 1 was based on Red Hat Linux 9 and shipped with version 2.4.19 of the Linux kernel, version 2.4 of the ...

Larry Fedora (@CoachFedora) on Twitter
Log in Sign up You are on Twitter Mobile because you are using an old version of Internet Explorer. Learn more here Larry Fedora @ CoachFedora ...

A new contributor agreement for Fedora - Flickr - Photo Sharing!
Read the article on opensource.com A new contributor agreement for Fedora Created by Adrienne Yancey for opensource.com

Flappy Fedora - YouTube
Get ready to smash your iPhones, because this shit is too brave for the App Store! PLAY IT ONLINE HERE! http://flappyfedora.com/ To play on your ...

FanSided Pays Tribute to Tom Landry’s Trademark Fedora
... website site MMQB strung together 95 league artifacts to coincide with the NFL’s 95th anniversary, the famed Dallas Cowboys head coach’s fedora ...

Fedora 18 beta (almost) brings MATE alternative to GNOME desktop
Сподели знаење The Red Hat-sponsored Fedora Project today released the beta version of Fedora version 18, nicknamed "Spherical Cow." The Linux ...

Reddit Puts on Its Amateur Detective Fedora to Find the Culprit Behind the Boston Bombings
Just in case Reddit's sense of self-importance wasn't inflated enough, the online community has taken to playing FBI dress-up, creating a subreddit ...

Fedora 21 Alpha is finally here Linux fans, download it now!
... it that way. My loyalty is not blind however, as I still demand a consistent quality product. Much like my loyalty to Ford, I am also a Fedora ...

Feds: Jesse Jackson, Jr. Used $750,000 in Campaign Funds to Buy a Michael Jackson Fedora and Gold Jewelry ...
... $11,130 on Martin Luther King memorabilila [sic] and $22,700 on Michael Jackson items, including $4,600 for a "Michael Jackson fedora." The ...

How to enable the graphical boot Plymouth on Fedora 10
Hi guys, few days ago I wrote a little guide to help people install VMware Tools on your brand new Fedora 10 installed through VMware Fusion ...

Resources last updated: 2/20/2016 11:12:28 PM