Smoke [5.12.2] v5.12.2-3-g4ffae9c FAIL(F) MSWin32 WinXP/.Net SP3 (x86/2 cpu) #3

Automated smoke report for 5.12.2 patch 4ffae9cec64e9dd4150c249b8d63bdceb4e=
65fb2 v5.12.2-3-g4ffae9c
maldoror.bath.planit.group: Intel(R) Core(TM)2 CPU 6700 @ 2.66GHz(~2660 MHz=
) (x86/2 cpu)
    on        MSWin32 - WinXP/.Net SP3
    using     bcc32 version 5.5.1
    smoketime 6 hours 49 minutes (average 40 minutes 59 seconds)

Summary: FAIL(F)

O =3D OK  F =3D Failure(s), extended report at the bottom
X =3D Failure(s) under TEST but not under harness
? =3D still running or test results not (yet) available
Build failures during:       - =3D unknown or N/A
c =3D Configure, m =3D make, M =3D make (after miniperl), t =3D make test-p=
rep

v5.12.2-3-g4ffae9c  Configuration (common) -DCCTYPE=3DBORLAND -DINST_TOP=3D=
$(INST_DRV)\Smoke\doesntexist
----------- ---------------------------------------------------------
F F         -Duselargefiles
F F         -Duselargefiles -Dusemymalloc
F F         -Duselargefiles -Duseithreads -Uuseimpsys
F F         -Duselargefiles -Duseithreads -Uuseimpsys -Dusemymalloc
F F         -Duselargefiles -Duseithreads
| +--------- -DDEBUGGING
+----------- no debugging


Locally applied patches:
    uncommitted-changes
    SMOKE4ffae9cec64e9dd4150c249b8d63bdceb4e65fb2

Failures: (common-args) -DCCTYPE=3DBORLAND -DINST_TOP=3D$(INST_DRV)\Smoke\d=
oesntexist
[default] -Duselargefiles
[default] -DDEBUGGING -Duselargefiles
[default] -Duselargefiles -Dusemymalloc
[default] -DDEBUGGING -Duselargefiles -Dusemymalloc
[default] -Duselargefiles -Duseithreads -Uuseimpsys
[default] -DDEBUGGING -Duselargefiles -Duseithreads -Uuseimpsys
[default] -DDEBUGGING -Duselargefiles -Duseithreads -Uuseimpsys -Dusemymall=
oc
.../t/io/errno.t.............................................FAILED
    1-16

[default] -Duselargefiles -Duseithreads -Uuseimpsys -Dusemymalloc
[default] -Duselargefiles -Duseithreads
.../t/io/errno.t.............................................FAILED
    1-16
.../t/op/threads.t...........................................FAILED
    Non-zero exit status: 5
    Bad plan.  You planned 18 tests but ran 9.

[default] -DDEBUGGING -Duselargefiles -Duseithreads
.../t/io/errno.t.............................................FAILED
    1-16
.../dist/IO/t/io_sock.t......................................FAILED

Compiler messages(bcc32):
Warning W8004 blocksort.c 901: 'numQSorted' is assigned a value that is nev=
er used in function mainSort
Warning W8004 compress.c 225: 'zPend' is assigned a value that is never use=
d in function generateMTFValues
Warning W8004 compress.c 598: 'nBytes' is assigned a value that is never us=
ed in function sendMTFValues
Warning W8008 decompress.c 588: Condition is always true in function BZ2_de=
compress
Warning W8008 decompress.c 591: Condition is always true in function BZ2_de=
compress
Warning W8008 bzlib.c 93: Condition is always false in function bz_config_ok
Warning W8066 bzlib.c 93: Unreachable code in function bz_config_ok
Warning W8008 bzlib.c 94: Condition is always false in function bz_config_ok
Warning W8066 bzlib.c 94: Unreachable code in function bz_config_ok
Warning W8008 bzlib.c 95: Condition is always false in function bz_config_ok
Warning W8066 bzlib.c 95: Unreachable code in function bz_config_ok
Warning W8057 bzlib.c 111: Parameter 'opaque' is never used in function def=
ault_bzalloc
Warning W8057 bzlib.c 117: Parameter 'opaque' is never used in function def=
ault_bzfree
Warning W8004 bzlib.c 454: 'progress' is assigned a value that is never use=
d in function BZ2_bzCompress
Warning W8066 bzlib.c 866: Unreachable code in function BZ2_bzDecompress
Warning W8008 bzlib.c 866: Condition is always true in function BZ2_bzDecom=
press
Warning W8008 crc32.c 232: Condition is always true in function crc32
Warning W8066 crc32.c 242: Unreachable code in function crc32
Warning W8004 deflate.c 351: 'hash_head' is assigned a value that is never =
used in function deflateSetDictionary
Warning W8008 deflate.c 1278: Condition is always false in function fill_wi=
ndow
Warning W8066 deflate.c 1279: Unreachable code in function fill_window
Warning W8004 deflate.c 1669: 'bflush' is assigned a value that is never us=
ed in function deflate_slow

--=20
Report by Test::Smoke v1.43 build 1271 running on perl 5.11.0
(Reporter v0.035 / Smoker v0.045)

0
SteveHay
11/7/2010 1:51:00 AM
perl.perl5.porters 47813 articles. 1 followers. Follow

0 Replies
493 Views

Similar Articles

[PageSpeed] 56

Reply:

Similar Artilces:

Smoke [5.12.2] v5.12.2-3-g4ffae9c FAIL(F) MSWin32 WinXP/.Net SP3 (x86/2 cpu) #2
Automated smoke report for 5.12.2 patch 4ffae9cec64e9dd4150c249b8d63bdceb4e= 65fb2 v5.12.2-3-g4ffae9c maldoror.bath.planit.group: Intel(R) Core(TM)2 CPU 6700 @ 2.66GHz(~2660 MHz= ) (x86/2 cpu) on MSWin32 - WinXP/.Net SP3 using cl version 13.10.3077 smoketime 6 hours 31 minutes (average 39 minutes 12 seconds) Summary: FAIL(F) O =3D OK F =3D Failure(s), extended report at the bottom X =3D Failure(s) under TEST but not under harness ? =3D still running or test results not (yet) available Build failures during: - =3D unknown or N/A c =3D Configure, m =...

Smoke [5.12.2] v5.12.2-3-g4ffae9c FAIL(F) MSWin32 WinXP/.Net SP3 (x86/2 cpu) #5
Automated smoke report for 5.12.2 patch 4ffae9cec64e9dd4150c249b8d63bdceb4e= 65fb2 v5.12.2-3-g4ffae9c maldoror.bath.planit.group: Intel(R) Core(TM)2 CPU 6700 @ 2.66GHz(~2660 MHz= ) (x86/2 cpu) on MSWin32 - WinXP/.Net SP3 using cl version 12.00.8804 smoketime 6 hours 26 minutes (average 38 minutes 40 seconds) Summary: FAIL(F) O =3D OK F =3D Failure(s), extended report at the bottom X =3D Failure(s) under TEST but not under harness ? =3D still running or test results not (yet) available Build failures during: - =3D unknown or N/A c =3D Configure, m =...

Smoke [5.12.2] v5.12.2-3-g4ffae9c FAIL(F) MSWin32 WinXP/.Net SP3 (x86/2 cpu)
Automated smoke report for 5.12.2 patch 4ffae9cec64e9dd4150c249b8d63bdceb4e= 65fb2 v5.12.2-3-g4ffae9c maldoror.bath.planit.group: Intel(R) Core(TM)2 CPU 6700 @ 2.66GHz(~2660 MHz= ) (x86/2 cpu) on MSWin32 - WinXP/.Net SP3 using bcc32 version 5.5.1 smoketime 6 hours 44 minutes (average 40 minutes 28 seconds) Summary: FAIL(F) O =3D OK F =3D Failure(s), extended report at the bottom X =3D Failure(s) under TEST but not under harness ? =3D still running or test results not (yet) available Build failures during: - =3D unknown or N/A c =3D Configure, m =3D...

Smoke [5.12.2] v5.12.2-3-g4ffae9c FAIL(F) MSWin32 WinXP/.Net SP3 (x86/2 cpu) #7
Automated smoke report for 5.12.2 patch 4ffae9cec64e9dd4150c249b8d63bdceb4e= 65fb2 v5.12.2-3-g4ffae9c maldoror.bath.planit.group: Intel(R) Core(TM)2 CPU 6700 @ 2.66GHz(~2660 MHz= ) (x86/2 cpu) on MSWin32 - WinXP/.Net SP3 using cl version 14.00.50727.762 smoketime 6 hours 47 minutes (average 40 minutes 44 seconds) Summary: FAIL(F) O =3D OK F =3D Failure(s), extended report at the bottom X =3D Failure(s) under TEST but not under harness ? =3D still running or test results not (yet) available Build failures during: - =3D unknown or N/A c =3D Configure...

Smoke [5.12.2] v5.12.2-3-g4ffae9c FAIL(F) MSWin32 WinXP/.Net SP3 (x86/2 cpu) #6
Automated smoke report for 5.12.2 patch 4ffae9cec64e9dd4150c249b8d63bdceb4e= 65fb2 v5.12.2-3-g4ffae9c maldoror.bath.planit.group: Intel(R) Core(TM)2 CPU 6700 @ 2.66GHz(~2660 MHz= ) (x86/2 cpu) on MSWin32 - WinXP/.Net SP3 using cl version 12.00.8804 smoketime 6 hours 27 minutes (average 38 minutes 42 seconds) Summary: FAIL(F) O =3D OK F =3D Failure(s), extended report at the bottom X =3D Failure(s) under TEST but not under harness ? =3D still running or test results not (yet) available Build failures during: - =3D unknown or N/A c =3D Configure, m =...

Smoke [5.12.2] v5.12.2-3-g4ffae9c FAIL(F) MSWin32 WinXP/.Net SP3 (x86/2 cpu) #8
Automated smoke report for 5.12.2 patch 4ffae9cec64e9dd4150c249b8d63bdceb4e= 65fb2 v5.12.2-3-g4ffae9c maldoror.bath.planit.group: Intel(R) Core(TM)2 CPU 6700 @ 2.66GHz(~2660 MHz= ) (x86/2 cpu) on MSWin32 - WinXP/.Net SP3 using cl version 14.00.50727.762 smoketime 6 hours 47 minutes (average 40 minutes 45 seconds) Summary: FAIL(F) O =3D OK F =3D Failure(s), extended report at the bottom X =3D Failure(s) under TEST but not under harness ? =3D still running or test results not (yet) available Build failures during: - =3D unknown or N/A c =3D Configure...

Smoke [5.12.2] v5.12.2-3-g4ffae9c FAIL(F) MSWin32 WinXP/.Net SP3 (x86/2 cpu) #9
Automated smoke report for 5.12.2 patch 4ffae9cec64e9dd4150c249b8d63bdceb4e= 65fb2 v5.12.2-3-g4ffae9c maldoror.bath.planit.group: Intel(R) Core(TM)2 CPU 6700 @ 2.66GHz(~2660 MHz= ) (x86/2 cpu) on MSWin32 - WinXP/.Net SP3 using cl version 15.00.30729.01 smoketime 6 hours 53 minutes (average 41 minutes 21 seconds) Summary: FAIL(F) O =3D OK F =3D Failure(s), extended report at the bottom X =3D Failure(s) under TEST but not under harness ? =3D still running or test results not (yet) available Build failures during: - =3D unknown or N/A c =3D Configure,...

Smoke [5.12.2] v5.12.2-3-g4ffae9c FAIL(F) MSWin32 WinXP/.Net SP3 (x86/2 cpu) #4
Automated smoke report for 5.12.2 patch 4ffae9cec64e9dd4150c249b8d63bdceb4e= 65fb2 v5.12.2-3-g4ffae9c maldoror.bath.planit.group: Intel(R) Core(TM)2 CPU 6700 @ 2.66GHz(~2660 MHz= ) (x86/2 cpu) on MSWin32 - WinXP/.Net SP3 using cl version 13.10.3077 smoketime 6 hours 34 minutes (average 39 minutes 27 seconds) Summary: FAIL(F) O =3D OK F =3D Failure(s), extended report at the bottom X =3D Failure(s) under TEST but not under harness ? =3D still running or test results not (yet) available Build failures during: - =3D unknown or N/A c =3D Configure, m =...

Smoke [5.12.2] v5.12.2-3-g4ffae9c FAIL(F) MSWin32 WinXP/.Net SP3 (x86/2 cpu) #10
Automated smoke report for 5.12.2 patch 4ffae9cec64e9dd4150c249b8d63bdceb4e= 65fb2 v5.12.2-3-g4ffae9c maldoror.bath.planit.group: Intel(R) Core(TM)2 CPU 6700 @ 2.66GHz(~2660 MHz= ) (x86/2 cpu) on MSWin32 - WinXP/.Net SP3 using bcc32 version 5.5.1 smoketime 6 hours 51 minutes (average 41 minutes 9 seconds) Summary: FAIL(F) O =3D OK F =3D Failure(s), extended report at the bottom X =3D Failure(s) under TEST but not under harness ? =3D still running or test results not (yet) available Build failures during: - =3D unknown or N/A c =3D Configure, m =3D ...

Smoke [5.12.2] v5.12.2-5-g60a58e9 FAIL(F) MSWin32 WinXP/.Net SP3 (x86/2 cpu) #3
Automated smoke report for 5.12.2 patch 60a58e98bf9da0f7e06e47974d829b42b2c= c834e v5.12.2-5-g60a58e9 maldoror.bath.planit.group: Intel(R) Core(TM)2 CPU 6700 @ 2.66GHz(~2660 MHz= ) (x86/2 cpu) on MSWin32 - WinXP/.Net SP3 using cl version 15.00.30729.01 smoketime 6 hours 48 minutes (average 40 minutes 51 seconds) Summary: FAIL(F) O =3D OK F =3D Failure(s), extended report at the bottom X =3D Failure(s) under TEST but not under harness ? =3D still running or test results not (yet) available Build failures during: - =3D unknown or N/A c =3D Configure,...

Smoke [5.12.2] v5.12.2 FAIL(F) MSWin32 WinXP/.Net SP3 (x86/2 cpu) #3
Automated smoke report for 5.12.2 patch 7a3b65c9d99f69553fffe01f73d49fe9abf= 95120 v5.12.2 maldoror.bath.planit.group: Intel(R) Core(TM)2 CPU 6700 @ 2.66GHz(~2660 MHz= ) (x86/2 cpu) on MSWin32 - WinXP/.Net SP3 using cl version 13.10.3077 smoketime 6 hours 51 minutes (average 41 minutes 12 seconds) Summary: FAIL(F) O =3D OK F =3D Failure(s), extended report at the bottom X =3D Failure(s) under TEST but not under harness ? =3D still running or test results not (yet) available Build failures during: - =3D unknown or N/A c =3D Configure, m =3D make, M ...

Smoke [5.12.2] v5.12.2-3-g4ffae9c FAIL(FM) MSWin32 WinXP/.Net SP3 (x86/2 cpu)
Automated smoke report for 5.12.2 patch 4ffae9cec64e9dd4150c249b8d63bdceb4e= 65fb2 v5.12.2-3-g4ffae9c maldoror.bath.planit.group: Intel(R) Core(TM)2 CPU 6700 @ 2.66GHz(~2660 MHz= ) (x86/2 cpu) on MSWin32 - WinXP/.Net SP3 using bcc32 version 5.5.1 smoketime 17 hours 37 minutes (average 1 hour 45 minutes) Summary: FAIL(FM) O =3D OK F =3D Failure(s), extended report at the bottom X =3D Failure(s) under TEST but not under harness ? =3D still running or test results not (yet) available Build failures during: - =3D unknown or N/A c =3D Configure, m =3D m...

Smoke [5.12.2] v5.12.2-4-g6b6803c FAIL(F) MSWin32 WinXP/.Net SP3 (x86/2 cpu) #3
Automated smoke report for 5.12.2 patch 6b6803ca5cc042a20bd63333defdcf9b4b5= a045c v5.12.2-4-g6b6803c maldoror.bath.planit.group: Intel(R) Core(TM)2 CPU 6700 @ 2.66GHz(~2660 MHz= ) (x86/2 cpu) on MSWin32 - WinXP/.Net SP3 using cl version 15.00.30729.01 smoketime 6 hours 52 minutes (average 41 minutes 12 seconds) Summary: FAIL(F) O =3D OK F =3D Failure(s), extended report at the bottom X =3D Failure(s) under TEST but not under harness ? =3D still running or test results not (yet) available Build failures during: - =3D unknown or N/A c =3D Configure,...

Smoke [5.12.2] v5.12.2-40-g05571b7 FAIL(F) MSWin32 WinXP/.Net SP3 (x86/2 cpu) #3
Automated smoke report for 5.12.2 patch 05571b730ab4be3bed6df4217c897bbadde= bc6b3 v5.12.2-40-g05571b7 maldoror.bath.planit.group: Intel(R) Core(TM)2 CPU 6700 @ 2.66GHz(~2660 MHz= ) (x86/2 cpu) on MSWin32 - WinXP/.Net SP3 using bcc32 version 5.5.1 smoketime 6 hours 54 minutes (average 41 minutes 28 seconds) Summary: FAIL(F) O =3D OK F =3D Failure(s), extended report at the bottom X =3D Failure(s) under TEST but not under harness ? =3D still running or test results not (yet) available Build failures during: - =3D unknown or N/A c =3D Configure, m =3...

Web resources about - Smoke [5.12.2] v5.12.2-3-g4ffae9c FAIL(F) MSWin32 WinXP/.Net SP3 (x86/2 cpu) #3 - perl.perl5.porters

Resources last updated: 12/9/2015 10:06:58 AM