Smoke [5.11.3] v5.11.3-34-gf099890 FAIL(XF) netbsd 5.0.1 (i386/1 cpu)

Automated smoke report for 5.11.3 patch f09989092a6586d2bb4173c4c08882afef55b70f v5.11.3-34-gf099890
p5netbsd: Intel 686-class (i386/1 cpu)
    on        netbsd - 5.0.1
    using     cc version 4.1.3 20080704 prerelease (NetBSD nb2 20081120)
    smoketime 6 hours 35 minutes (average 49 minutes 26 seconds)

Summary: FAIL(XF)

O = OK  F = Failure(s), extended report at the bottom
X = Failure(s) under TEST but not under harness
? = still running or test results not (yet) available
Build failures during:       - = unknown or N/A
c = Configure, m = make, M = make (after miniperl), t = make test-prep

v5.11.3-34-gf099890  Configuration (common) none
----------- ---------------------------------------------------------
O O O X     
O O O O     -Duse64bitint
O F O O     -Duseithreads
X O O X     -Duseithreads -Duse64bitint
| | | +----- PERLIO = perlio -DDEBUGGING
| | +------- PERLIO = stdio  -DDEBUGGING
| +--------- PERLIO = perlio
+----------- PERLIO = stdio


Locally applied patches:
    SMOKEf09989092a6586d2bb4173c4c08882afef55b70f

Failures: (common-args) none
[perlio] -DDEBUGGING
[perlio] -DDEBUGGING -Duseithreads -Duse64bitint
Inconsistent test results (between TEST and harness):
    ../lib/Benchmark.t......................FAILED at test 127

[perlio] -Duseithreads
    ../lib/Benchmark.t..........................................FAILED
        126-127

[stdio] -Duseithreads -Duse64bitint
Inconsistent test results (between TEST and harness):
    ../lib/Benchmark.t......................FAILED at test 126

Compiler messages(gcc):
perlio.c: In function 'PerlIOStdio_set_ptrcnt':
perlio.c:3437: warning: pointer targets in assignment differ in signedness
/usr/include/sys/cdefs_elf.h:67:20: error: missing binary operator before token "("
<command line>:1:1: warning: "TIME_HIRES_STAT" redefined
<command line>:1:1: warning: this is the location of the previous definition
APItest.xs: In function 'XS_XS__APItest_pmflag':
APItest.xs:930: warning: 'Perl_pmflag' is deprecated (declared at ../../proto.h:2610)

-- 
Report by Test::Smoke v1.40 build 1242 running on perl 5.10.0
(Reporter v0.035 / Smoker v0.044)
0
stsc
1/6/2010 5:32:08 AM
perl.perl5.porters 47902 articles. 1 followers. Follow

0 Replies
639 Views

Similar Articles

[PageSpeed] 22

Reply:

Similar Artilces:

Smoke [5.11.3] v5.11.3-3-gc3c0aa2 FAIL(XF) netbsd 5.0.1 (i386/1 cpu)
Automated smoke report for 5.11.3 patch c3c0aa283b73660f84ae7e190dcbbd607facb512 v5.11.3-3-gc3c0aa2 p5netbsd: Intel 686-class (i386/1 cpu) on netbsd - 5.0.1 using cc version 4.1.3 20080704 prerelease (NetBSD nb2 20081120) smoketime 6 hours 47 minutes (average 50 minutes 57 seconds) Summary: FAIL(XF) O = OK F = Failure(s), extended report at the bottom X = Failure(s) under TEST but not under harness ? = still running or test results not (yet) available Build failures during: - = unknown or N/A c = Configure, m = make, M = make (after miniperl), t = ma...

Smoke [5.11.3] v5.11.3-5-g27bca32 FAIL(XF) netbsd 5.0.1 (i386/1 cpu)
Automated smoke report for 5.11.3 patch 27bca3226281a592aed848b7e68ea50f27381dac v5.11.3-5-g27bca32 p5netbsd: Intel 686-class (i386/1 cpu) on netbsd - 5.0.1 using cc version 4.1.3 20080704 prerelease (NetBSD nb2 20081120) smoketime 6 hours 44 minutes (average 50 minutes 37 seconds) Summary: FAIL(XF) O = OK F = Failure(s), extended report at the bottom X = Failure(s) under TEST but not under harness ? = still running or test results not (yet) available Build failures during: - = unknown or N/A c = Configure, m = make, M = make (after miniperl), t = ma...

Smoke [5.11.3] v5.11.3-17-g2dba5d6 FAIL(XF) netbsd 5.0.1 (i386/1 cpu)
Automated smoke report for 5.11.3 patch 2dba5d6056865b047ab6a58cf258c870472b3fe2 v5.11.3-17-g2dba5d6 p5netbsd: Intel 686-class (i386/1 cpu) on netbsd - 5.0.1 using cc version 4.1.3 20080704 prerelease (NetBSD nb2 20081120) smoketime 6 hours 34 minutes (average 49 minutes 21 seconds) Summary: FAIL(XF) O = OK F = Failure(s), extended report at the bottom X = Failure(s) under TEST but not under harness ? = still running or test results not (yet) available Build failures during: - = unknown or N/A c = Configure, m = make, M = make (after miniperl), t = m...

Smoke [5.11.3] v5.11.3-98-g83452f8 FAIL(XF) netbsd 5.0.1 (i386/1 cpu)
Automated smoke report for 5.11.3 patch 83452f8ea6ad77da7b6d12f161eedb3db3e647f3 v5.11.3-98-g83452f8 p5netbsd: Intel 686-class (i386/1 cpu) on netbsd - 5.0.1 using cc version 4.1.3 20080704 prerelease (NetBSD nb2 20081120) smoketime 6 hours 35 minutes (average 49 minutes 27 seconds) Summary: FAIL(XF) O = OK F = Failure(s), extended report at the bottom X = Failure(s) under TEST but not under harness ? = still running or test results not (yet) available Build failures during: - = unknown or N/A c = Configure, m = make, M = make (after miniperl), t = m...

Smoke [5.11.3] v5.11.3-108-gcb4a303 FAIL(XF) netbsd 5.0.1 (i386/1 cpu)
Automated smoke report for 5.11.3 patch cb4a303650e05576b6797aaca1373576a2f37af7 v5.11.3-108-gcb4a303 p5netbsd: Intel 686-class (i386/1 cpu) on netbsd - 5.0.1 using cc version 4.1.3 20080704 prerelease (NetBSD nb2 20081120) smoketime 6 hours 37 minutes (average 49 minutes 40 seconds) Summary: FAIL(XF) O = OK F = Failure(s), extended report at the bottom X = Failure(s) under TEST but not under harness ? = still running or test results not (yet) available Build failures during: - = unknown or N/A c = Configure, m = make, M = make (after miniperl), t = ...

Smoke [5.11.3] v5.11.3-55-gb1b34a5 FAIL(XF) netbsd 5.0.1 (i386/1 cpu)
Automated smoke report for 5.11.3 patch b1b34a557d6a0b1b784977e95bea3db696ad19c9 v5.11.3-55-gb1b34a5 p5netbsd: Intel 686-class (i386/1 cpu) on netbsd - 5.0.1 using cc version 4.1.3 20080704 prerelease (NetBSD nb2 20081120) smoketime 6 hours 36 minutes (average 49 minutes 35 seconds) Summary: FAIL(XF) O = OK F = Failure(s), extended report at the bottom X = Failure(s) under TEST but not under harness ? = still running or test results not (yet) available Build failures during: - = unknown or N/A c = Configure, m = make, M = make (after miniperl), t = m...

Smoke [5.11.3] v5.11.3-126-g1f730e6 FAIL(XF) netbsd 5.0.1 (i386/1 cpu)
Automated smoke report for 5.11.3 patch 1f730e6c11736bad913e605b064200a67117e898 v5.11.3-126-g1f730e6 p5netbsd: Intel 686-class (i386/1 cpu) on netbsd - 5.0.1 using cc version 4.1.3 20080704 prerelease (NetBSD nb2 20081120) smoketime 6 hours 35 minutes (average 49 minutes 29 seconds) Summary: FAIL(XF) O = OK F = Failure(s), extended report at the bottom X = Failure(s) under TEST but not under harness ? = still running or test results not (yet) available Build failures during: - = unknown or N/A c = Configure, m = make, M = make (after miniperl), t = ...

Smoke [5.11.3] v5.11.3-42-g06fc686 FAIL(XF) netbsd 5.0.1 (i386/1 cpu)
Automated smoke report for 5.11.3 patch 06fc68671f70339bdc6ddf5b7367ae9db8b4cd2a v5.11.3-42-g06fc686 p5netbsd: Intel 686-class (i386/1 cpu) on netbsd - 5.0.1 using cc version 4.1.3 20080704 prerelease (NetBSD nb2 20081120) smoketime 6 hours 36 minutes (average 49 minutes 31 seconds) Summary: FAIL(XF) O = OK F = Failure(s), extended report at the bottom X = Failure(s) under TEST but not under harness ? = still running or test results not (yet) available Build failures during: - = unknown or N/A c = Configure, m = make, M = make (after miniperl), t = m...

Smoke [5.11.3] v5.11.3-10-g9f815e2 FAIL(XF) netbsd 5.0.1 (i386/1 cpu)
Automated smoke report for 5.11.3 patch 9f815e241cf04d04fc645970753438216a0ed024 v5.11.3-10-g9f815e2 p5netbsd: Intel 686-class (i386/1 cpu) on netbsd - 5.0.1 using cc version 4.1.3 20080704 prerelease (NetBSD nb2 20081120) smoketime 6 hours 46 minutes (average 50 minutes 51 seconds) Summary: FAIL(XF) O = OK F = Failure(s), extended report at the bottom X = Failure(s) under TEST but not under harness ? = still running or test results not (yet) available Build failures during: - = unknown or N/A c = Configure, m = make, M = make (after miniperl), t = m...

Smoke [5.11.3] v5.11.3-63-g3365b41 FAIL(XM) netbsd 5.0.1 (i386/1 cpu)
Automated smoke report for 5.11.3 patch 3365b4123660b600293d3f9bd5054523f194b5b9 v5.11.3-63-g3365b41 p5netbsd: Intel 686-class (i386/1 cpu) on netbsd - 5.0.1 using cc version 4.1.3 20080704 prerelease (NetBSD nb2 20081120) smoketime 6 hours (average 45 minutes 7 seconds) Summary: FAIL(XM) O = OK F = Failure(s), extended report at the bottom X = Failure(s) under TEST but not under harness ? = still running or test results not (yet) available Build failures during: - = unknown or N/A c = Configure, m = make, M = make (after miniperl), t = make test-pre...

Smoke [5.11.3] v5.11.3-51-g4149198 FAIL(Fm) netbsd 5.0.1 (i386/1 cpu)
Automated smoke report for 5.11.3 patch 4149198fba64273f3fea8fc073ccb5d080059f4a v5.11.3-51-g4149198 p5netbsd: Intel 686-class (i386/1 cpu) on netbsd - 5.0.1 using cc version 4.1.3 20080704 prerelease (NetBSD nb2 20081120) smoketime 4 hours 37 minutes (average 34 minutes 38 seconds) Summary: FAIL(Fm) O = OK F = Failure(s), extended report at the bottom X = Failure(s) under TEST but not under harness ? = still running or test results not (yet) available Build failures during: - = unknown or N/A c = Configure, m = make, M = make (after miniperl), t = m...

Smoke [5.11.3] v5.11.3-119-gc25e53b FAIL(F) netbsd 5.0.1 (i386/1 cpu)
Automated smoke report for 5.11.3 patch c25e53bef71ab0f21ff2b53e7adf829f605eadad v5.11.3-119-gc25e53b p5netbsd: Intel 686-class (i386/1 cpu) on netbsd - 5.0.1 using cc version 4.1.3 20080704 prerelease (NetBSD nb2 20081120) smoketime 6 hours 41 minutes (average 50 minutes 8 seconds) Summary: FAIL(F) O = OK F = Failure(s), extended report at the bottom X = Failure(s) under TEST but not under harness ? = still running or test results not (yet) available Build failures during: - = unknown or N/A c = Configure, m = make, M = make (after miniperl), t = ma...

Smoke [5.11.3] v5.11.3-22-gfd90943 FAIL(XM) netbsd 5.0.1 (i386/1 cpu)
Automated smoke report for 5.11.3 patch fd909433c74372968d34d9cad8f4458ab60e19b4 v5.11.3-22-gfd90943 p5netbsd: Intel 686-class (i386/1 cpu) on netbsd - 5.0.1 using cc version 4.1.3 20080704 prerelease (NetBSD nb2 20081120) smoketime 5 hours 41 minutes (average 42 minutes 39 seconds) Summary: FAIL(XM) O = OK F = Failure(s), extended report at the bottom X = Failure(s) under TEST but not under harness ? = still running or test results not (yet) available Build failures during: - = unknown or N/A c = Configure, m = make, M = make (after miniperl), t = m...

Smoke [5.11.1] v5.11.1-68-g34861f2 FAIL(XF) netbsd 5.0.1 (i386/1 cpu)
Automated smoke report for 5.11.1 patch 34861f291d6c548304b74dfc30ff27447f1b582f v5.11.1-68-g34861f2 p5netbsd: Intel 686-class (i386/1 cpu) on netbsd - 5.0.1 using cc version 4.1.3 20080704 prerelease (NetBSD nb2 20081120) smoketime 6 hours 33 minutes (average 49 minutes 14 seconds) Summary: FAIL(XF) O = OK F = Failure(s), extended report at the bottom X = Failure(s) under TEST but not under harness ? = still running or test results not (yet) available Build failures during: - = unknown or N/A c = Configure, m = make, M = make (after miniperl), t = m...

Web resources about - Smoke [5.11.3] v5.11.3-34-gf099890 FAIL(XF) netbsd 5.0.1 (i386/1 cpu) - perl.perl5.porters

Trumpscript: a programming language based on the rhetorical tactics of Donald Trump
Trumpscript a python variant only allows numbers over 1,000,000; has no import statements (all declarations must be homegrown); only has integers ...

Learn How to Port Your iOS App to Windows 10
It’s no surprise that Microsoft wants us to create apps that can run on Windows 10. To that end, the company has posted a tutorial for everyone ...

Princess Leia Appeared on Star Wars Rebels, Complete With Her Trademark Authority
Star Wars Rebels returned Wednesday for the back half of its second season and it did so with a major player joining the show. Welcome Princess ...

Facebook Sports Stadium Opens Its Doors
You don’t need a ticket to get into Facebook Sports Stadium—an iPhone in the U.S. will allow users of the social network admission to a real-time ...

Even Bill Doesn’t Like Hillary Clinton’s Primary Strategy
According to reporting from Politico , Bill Clinton is getting increasingly “nervous” about his wife Democratic presidential candidate Hillary ...

Mark Ruffalo Compares ‘Thor: Ragnarok’ to ‘Midnight Run,’ Which Is Really All You Need to Hear
The first two Thor movies have their moments, but they’re among the Marvel Cinematic Universe’s more forgettable chapters. They never reach the ...

How the WaPo whitewashed the Flint water disaster
I’m one of those masochists who signs up for daily email alerts from several news services just to keep tabs on the stories I might miss on cable ...

Ninth planet in solar system probably exists, astronomers say
For those of us who grew up learning about the solar system ‘s nine planets, there may be nothing that can fill that Pluto-shaped hole in our ...

The latest on the potentially historic East Coast snowstorm
A potentially historic snowstorm is all but certain to crush Washington, D.C., and the surrounding region beginning Friday afternoon with up ...

US Air Force Drones Crashed In Record Numbers Last Year
It goes without saying that many battles in this day and age are fought remotely, as technology advances in such a manner so as to deliver a ...

Resources last updated: 1/21/2016 6:21:43 PM