Smoke [5.11.3] v5.11.3-3-gc3c0aa2 FAIL(F) linux 2.6.31-14-generic [debian] (x86_64/8 cpu)

Automated smoke report for 5.11.3 patch c3c0aa283b73660f84ae7e190dcbbd607fa=
cb512 v5.11.3-3-gc3c0aa2
zwei: Intel(R) Core(TM) i7 CPU 920 @ 2.67GHz (GenuineIntel 1600MHz) (x86_64=
/8 cpu)
    on        linux - 2.6.31-14-generic [debian]
    using     cc version 4.4.1
    smoketime 8 hours 20 minutes (average 31 minutes 16 seconds)

Summary: FAIL(F)

O =3D OK  F =3D Failure(s), extended report at the bottom
X =3D Failure(s) under TEST but not under harness
? =3D still running or test results not (yet) available
Build failures during:       - =3D unknown or N/A
c =3D Configure, m =3D make, M =3D make (after miniperl), t =3D make test-p=
rep

v5.11.3-3-gc3c0aa2  Configuration (common) none
----------- ---------------------------------------------------------
O O F O O F=20
O O F O O F -Duse64bitint
F F F F F F -Duselongdouble
F F F F F F -Dusemorebits
O O F O O F -Duseithreads
O O F O O F -Duseithreads -Duse64bitint
F F F F F F -Duseithreads -Duselongdouble
F F F F F F -Duseithreads -Dusemorebits
| | | | | +- LC_ALL =3D en_US.utf8 -DDEBUGGING
| | | | +--- PERLIO =3D perlio -DDEBUGGING
| | | +----- PERLIO =3D stdio  -DDEBUGGING
| | +------- LC_ALL =3D en_US.utf8
| +--------- PERLIO =3D perlio
+----------- PERLIO =3D stdio=20

Locally applied patches:
    SMOKEc3c0aa283b73660f84ae7e190dcbbd607facb512

Failures: (common-args) none
[en_US.utf8]=20
[en_US.utf8] -DDEBUGGING
[en_US.utf8] -Duse64bitint
[en_US.utf8] -DDEBUGGING -Duse64bitint
[en_US.utf8] -Duseithreads
[en_US.utf8] -DDEBUGGING -Duseithreads
[en_US.utf8] -Duseithreads -Duse64bitint
[en_US.utf8] -DDEBUGGING -Duseithreads -Duse64bitint
    ../t/porting/diag.t.........................................FAILED

[stdio] -Duselongdouble
[stdio] -Dusemorebits
    ../t/op/pack.t..............................................FAILED
        3934, 3936, 3939, 3941, 3944, 3946, 3949
        3951, 3954, 3956, 3984, 3986, 3989, 3991
        3994, 3996, 3999, 4001, 4004, 4006, 4310
        4320, 13566, 13568, 13570, 13572, 13574
        13577, 13732, 13734, 13736, 13738, 13740
        13743, 13746, 13749, 13752, 13755, 13758
        13761, 13764, 13767, 13770, 13773, 13776
        13779, 14374, 14380, 14383, 14389

[perlio] -Duselongdouble
[perlio] -Dusemorebits
    ../t/op/pack.t..............................................FAILED
        3934, 3936, 3939, 3941, 3944, 3946, 3949
        3951, 3954, 3956, 3984, 3986, 3989, 3991
        3994, 3996, 3999, 4001, 4004, 4006, 4310
        4320, 13566, 13568, 13570, 13572, 13574
        13577, 13580, 13583, 13586, 13589, 13592
        13595, 13598, 13601, 13604, 13607, 13610
        13613, 13616, 13619, 13732, 13734, 13736
        13738, 13740, 13743, 13746, 13749, 13752
        13755, 13758, 13761, 13764, 13767, 13770
        13773, 13776, 13779, 13782, 13785, 14374
        14380, 14383, 14389

[en_US.utf8] -Duselongdouble
[en_US.utf8] -Dusemorebits
    ../t/op/pack.t..............................................FAILED
        3934, 3936, 3939, 3941, 3944, 3946, 3949
        3951, 3954, 3956, 3984, 3986, 3989, 3991
        3994, 3996, 3999, 4001, 4004, 4006, 4310
        4320, 13566, 13568, 13570, 13572, 13574
        13577, 13580, 13583, 13586, 13589, 13592
        13595, 13598, 13601, 13604, 13607, 13610
        13613, 13616, 13619, 13732, 13734, 13736
        13738, 13740, 13743, 13746, 13749, 14374
        14380, 14383, 14389
    ../t/porting/diag.t.........................................FAILED

[stdio] -DDEBUGGING -Duselongdouble
    ../t/op/pack.t..............................................FAILED
        3934, 3936, 3939, 3944, 3949, 3954, 3984
        3989, 3994, 3999, 4004, 13568, 13572, 13580
        13583, 13589, 13595, 13601, 13607, 13613
        13734, 13738, 13746, 13752, 13758, 13764
        13770, 13776, 14374, 14380, 14383, 14389

[perlio] -DDEBUGGING -Duselongdouble
[stdio/perlio] -DDEBUGGING -Dusemorebits
    ../t/op/pack.t..............................................FAILED
        3934, 3936, 3939, 3944, 3949, 3954, 3984
        3989, 3994, 3999, 4004, 13568, 13572, 13580
        13583, 13589, 13595, 13601, 13607, 13613
        13616, 13734, 13738, 13746, 13752, 13758
        13764, 13770, 13776, 13782, 14374, 14380
        14383, 14389

[en_US.utf8] -DDEBUGGING -Duselongdouble
    ../t/op/pack.t..............................................FAILED
        3934, 3936, 3939, 3944, 3949, 3954, 3984
        3989, 3994, 3999, 4004, 13568, 13572, 13580
        13583, 13589, 13595, 13601, 13607, 13613
        13616, 13734, 13738, 13746, 13752, 13758
        13764, 13770, 13776, 13782, 14374, 14380
        14383, 14389
    ../t/porting/diag.t.........................................FAILED

[en_US.utf8] -DDEBUGGING -Dusemorebits
    ../t/op/pack.t..............................................FAILED
        3934, 3936, 3939, 3944, 3949, 3954, 3984
        3989, 3994, 3999, 4004, 13568, 13572, 13580
        13583, 13589, 13595, 13601, 13607, 13613
        13619, 13734, 13738, 13746, 13752, 13758
        13764, 13770, 13776, 13782, 14374, 14380
        14383, 14389
    ../t/porting/diag.t.........................................FAILED

[stdio/perlio] -Duseithreads -Duselongdouble
[stdio/perlio] -Duseithreads -Dusemorebits
    ../t/op/pack.t..............................................FAILED
        3934, 3936, 3939, 3944, 3949, 3954, 3984
        3989, 3994, 3999, 4004, 4310, 4320, 13566
        13577, 13732, 13743, 14374, 14380, 14383
        14389

[en_US.utf8] -Duseithreads -Duselongdouble
[en_US.utf8] -Duseithreads -Dusemorebits
    ../t/op/pack.t..............................................FAILED
        3934, 3936, 3939, 3944, 3949, 3954, 3984
        3989, 3994, 3999, 4004, 4310, 4320, 13566
        13577, 13732, 13743, 14374, 14380, 14383
        14389
    ../t/porting/diag.t.........................................FAILED

[stdio] -DDEBUGGING -Duseithreads -Duselongdouble
[stdio] -DDEBUGGING -Duseithreads -Dusemorebits
    ../t/op/pack.t..............................................FAILED
        3934, 3939, 3944, 3949, 3954, 3984, 3989
        3994, 3999, 4004, 13566, 13732, 14374, 14380
        14383, 14389

[perlio] -DDEBUGGING -Duseithreads -Duselongdouble
[perlio] -DDEBUGGING -Duseithreads -Dusemorebits
    ../t/op/pack.t..............................................FAILED
        3934, 3939, 3944, 3949, 3954, 3984, 3989
        3994, 3999, 4004, 14374, 14380, 14383, 14389

[en_US.utf8] -DDEBUGGING -Duseithreads -Duselongdouble
[en_US.utf8] -DDEBUGGING -Duseithreads -Dusemorebits
    ../t/op/pack.t..............................................FAILED
        3934, 3939, 3944, 3949, 3954, 3984, 3989
        3994, 3999, 4004, 13566, 13732, 14374, 14380
        14383, 14389
    ../t/porting/diag.t.........................................FAILED

Compiler messages(gcc):
try.c: In function =E2=80=98main=E2=80=99:
try.c:36: warning: ignoring return value of =E2=80=98pipe=E2=80=99, declare=
d with attribute warn_unused_result
try.c:37: warning: ignoring return value of =E2=80=98pipe=E2=80=99, declare=
d with attribute warn_unused_result
try.c:53: warning: ignoring return value of =E2=80=98write=E2=80=99, declar=
ed with attribute warn_unused_result
try.c:66: warning: ignoring return value of =E2=80=98write=E2=80=99, declar=
ed with attribute warn_unused_result
try.c:72: warning: ignoring return value of =E2=80=98write=E2=80=99, declar=
ed with attribute warn_unused_result
try.c:78: warning: ignoring return value of =E2=80=98read=E2=80=99, declare=
d with attribute warn_unused_result
perlio.c: In function =E2=80=98PerlIO_debug=E2=80=99:
perlio.c:517: warning: ignoring return value of =E2=80=98write=E2=80=99, de=
clared with attribute warn_unused_result
perlio.c: In function =E2=80=98S_more_refcounted_fds=E2=80=99:
perlio.c:2301: warning: ignoring return value of =E2=80=98write=E2=80=99, d=
eclared with attribute warn_unused_result
util.c: In function =E2=80=98S_write_no_mem=E2=80=99:
util.c:67: warning: ignoring return value of =E2=80=98write=E2=80=99, decla=
red with attribute warn_unused_result
sv.c: In function =E2=80=98Perl_sv_2pv_flags=E2=80=99:
sv.c:2769: warning: ignoring return value of =E2=80=98gcvt=E2=80=99, declar=
ed with attribute warn_unused_result
sv.c:2962: warning: ignoring return value of =E2=80=98gcvt=E2=80=99, declar=
ed with attribute warn_unused_result
sv.c: In function =E2=80=98Perl_sv_vcatpvfn=E2=80=99:
sv.c:9333: warning: ignoring return value of =E2=80=98gcvt=E2=80=99, declar=
ed with attribute warn_unused_result
sv.c:10138: warning: ignoring return value of =E2=80=98gcvt=E2=80=99, decla=
red with attribute warn_unused_result
doio.c: In function =E2=80=98Perl_nextargv=E2=80=99:
doio.c:870: warning: ignoring return value of =E2=80=98fchown=E2=80=99, dec=
lared with attribute warn_unused_result
doio.c: In function =E2=80=98S_exec_failed=E2=80=99:
doio.c:1380: warning: ignoring return value of =E2=80=98write=E2=80=99, dec=
lared with attribute warn_unused_result
Dumper.xs: In function =E2=80=98DD_dump=E2=80=99:
Dumper.xs:813: warning: format =E2=80=98%ld=E2=80=99 expects type =E2=80=98=
long int=E2=80=99, but argument 2 has type =E2=80=98U32=E2=80=99
Call.xs: In function =E2=80=98filter_call=E2=80=99:
Call.xs:63: warning: format =E2=80=98%d=E2=80=99 expects type =E2=80=98int=
=E2=80=99, but argument 3 has type =E2=80=98STRLEN=E2=80=99
Call.xs:63: warning: format =E2=80=98%d=E2=80=99 expects type =E2=80=98int=
=E2=80=99, but argument 5 has type =E2=80=98STRLEN=E2=80=99
Call.xs:100: warning: format =E2=80=98%d=E2=80=99 expects type =E2=80=98int=
=E2=80=99, but argument 4 has type =E2=80=98STRLEN=E2=80=99
Call.xs:156: warning: format =E2=80=98%d=E2=80=99 expects type =E2=80=98int=
=E2=80=99, but argument 3 has type =E2=80=98STRLEN=E2=80=99
Call.xs:175: warning: format =E2=80=98%d=E2=80=99 expects type =E2=80=98int=
=E2=80=99, but argument 4 has type =E2=80=98STRLEN=E2=80=99
sdbm.c: In function =E2=80=98makroom=E2=80=99:
sdbm.c:371: warning: ignoring return value of =E2=80=98write=E2=80=99, decl=
ared with attribute warn_unused_result
APItest.xs: In function =E2=80=98XS_XS__APItest_pmflag=E2=80=99:
APItest.xs:930: warning: =E2=80=98Perl_pmflag=E2=80=99 is deprecated (decla=
red at ../../proto.h:2608)
sv.c:2769: warning: ignoring return value of =E2=80=98qgcvt=E2=80=99, decla=
red with attribute warn_unused_result
sv.c:2962: warning: ignoring return value of =E2=80=98qgcvt=E2=80=99, decla=
red with attribute warn_unused_result
sv.c:10138: warning: ignoring return value of =E2=80=98qgcvt=E2=80=99, decl=
ared with attribute warn_unused_result
perlio.c:508: warning: ignoring return value of =E2=80=98write=E2=80=99, de=
clared with attribute warn_unused_result
perl.c: In function =E2=80=98S_init_tls_and_interp=E2=80=99:
perl.c:106: warning: ignoring return value of =E2=80=98write=E2=80=99, decl=
ared with attribute warn_unused_result
threads.xs: In function =E2=80=98S_ithread_create=E2=80=99:
threads.xs:701: warning: ignoring return value of =E2=80=98write=E2=80=99, =
declared with attribute warn_unused_result

--=20
Report by Test::Smoke v1.39 build 1235 running on perl 5.10.0
(Reporter v0.035 / Smoker v0.044)

0
perl
12/21/2009 9:04:00 PM
perl.perl5.porters 48151 articles. 1 followers. Follow

0 Replies
489 Views

Similar Articles

[PageSpeed] 53

Reply:

Similar Artilces:

Smoke [5.11.3] v5.11.3-5-g27bca32 FAIL(F) linux 2.6.31-14-generic [debian] (x86_64/8 cpu)
Automated smoke report for 5.11.3 patch 27bca3226281a592aed848b7e68ea50f273= 81dac v5.11.3-5-g27bca32 zwei: Intel(R) Core(TM) i7 CPU 920 @ 2.67GHz (GenuineIntel 1600MHz) (x86_64= /8 cpu) on linux - 2.6.31-14-generic [debian] using cc version 4.4.1 smoketime 8 hours 10 minutes (average 30 minutes 39 seconds) Summary: FAIL(F) O =3D OK F =3D Failure(s), extended report at the bottom X =3D Failure(s) under TEST but not under harness ? =3D still running or test results not (yet) available Build failures during: - =3D unknown or N/A c =3D Configure, m =3...

Smoke [5.11.3] v5.11.3-8-g5ef4d93 FAIL(F) linux 2.6.31-16-generic [debian] (x86_64/8 cpu)
Automated smoke report for 5.11.3 patch 5ef4d93ec97e5239010a45df06473288e04= f739a v5.11.3-8-g5ef4d93 zwei: Intel(R) Core(TM) i7 CPU 920 @ 2.67GHz (GenuineIntel 1600MHz) (x86_64= /8 cpu) on linux - 2.6.31-16-generic [debian] using cc version 4.4.1 smoketime 8 hours 33 minutes (average 32 minutes 5 seconds) Summary: FAIL(F) O =3D OK F =3D Failure(s), extended report at the bottom X =3D Failure(s) under TEST but not under harness ? =3D still running or test results not (yet) available Build failures during: - =3D unknown or N/A c =3D Configure, m =3D...

Smoke [5.11.3] v5.11.3-86-g73afaec FAIL(F) linux 2.6.31-16-generic [debian] (x86_64/8 cpu)
Automated smoke report for 5.11.3 patch 73afaec9a8c17d03643a56b3842448c172a= 26285 v5.11.3-86-g73afaec zwei: Intel(R) Core(TM) i7 CPU 920 @ 2.67GHz (GenuineIntel 1600MHz) (x86_64= /8 cpu) on linux - 2.6.31-16-generic [debian] using cc version 4.4.1 smoketime 7 hours 49 minutes (average 29 minutes 20 seconds) Summary: FAIL(F) O =3D OK F =3D Failure(s), extended report at the bottom X =3D Failure(s) under TEST but not under harness ? =3D still running or test results not (yet) available Build failures during: - =3D unknown or N/A c =3D Configure, m =...

Smoke [5.11.3] v5.11.3-87-g16610ad FAIL(F) linux 2.6.31-16-generic [debian] (x86_64/8 cpu)
Automated smoke report for 5.11.3 patch 16610ad906328dde8c0ce186f28478759b0= d03ba v5.11.3-87-g16610ad zwei: Intel(R) Core(TM) i7 CPU 920 @ 2.67GHz (GenuineIntel 1600MHz) (x86_64= /8 cpu) on linux - 2.6.31-16-generic [debian] using cc version 4.4.1 smoketime 7 hours 50 minutes (average 29 minutes 26 seconds) Summary: FAIL(F) O =3D OK F =3D Failure(s), extended report at the bottom X =3D Failure(s) under TEST but not under harness ? =3D still running or test results not (yet) available Build failures during: - =3D unknown or N/A c =3D Configure, m =...

Smoke [5.11.3] v5.11.3-84-g6f7a7d3 FAIL(F) linux 2.6.31-16-generic [debian] (x86_64/8 cpu)
Automated smoke report for 5.11.3 patch 6f7a7d3eeb6b7da414c3496d3eb5a7c4f51= 27201 v5.11.3-84-g6f7a7d3 zwei: Intel(R) Core(TM) i7 CPU 920 @ 2.67GHz (GenuineIntel 1600MHz) (x86_64= /8 cpu) on linux - 2.6.31-16-generic [debian] using cc version 4.4.1 smoketime 7 hours 49 minutes (average 29 minutes 19 seconds) Summary: FAIL(F) O =3D OK F =3D Failure(s), extended report at the bottom X =3D Failure(s) under TEST but not under harness ? =3D still running or test results not (yet) available Build failures during: - =3D unknown or N/A c =3D Configure, m =...

Smoke [5.11.3] v5.11.3-91-g32709fd FAIL(F) linux 2.6.31-16-generic [debian] (x86_64/8 cpu)
Automated smoke report for 5.11.3 patch 32709fdf41543f067562e0dc9944448dd11= d2c28 v5.11.3-91-g32709fd zwei: Intel(R) Core(TM) i7 CPU 920 @ 2.67GHz (GenuineIntel 2668MHz) (x86_64= /8 cpu) on linux - 2.6.31-16-generic [debian] using cc version 4.4.1 smoketime 8 hours 18 minutes (average 31 minutes 9 seconds) Summary: FAIL(F) O =3D OK F =3D Failure(s), extended report at the bottom X =3D Failure(s) under TEST but not under harness ? =3D still running or test results not (yet) available Build failures during: - =3D unknown or N/A c =3D Configure, m =3...

Smoke [5.11.3] v5.11.3-76-g1809c94 FAIL(F) linux 2.6.31-16-generic [debian] (x86_64/8 cpu)
Automated smoke report for 5.11.3 patch 1809c940bf4737dd262fc0c026e063316c4= 66a28 v5.11.3-76-g1809c94 zwei: Intel(R) Core(TM) i7 CPU 920 @ 2.67GHz (GenuineIntel 2668MHz) (x86_64= /8 cpu) on linux - 2.6.31-16-generic [debian] using cc version 4.4.1 smoketime 7 hours 45 minutes (average 29 minutes 4 seconds) Summary: FAIL(F) O =3D OK F =3D Failure(s), extended report at the bottom X =3D Failure(s) under TEST but not under harness ? =3D still running or test results not (yet) available Build failures during: - =3D unknown or N/A c =3D Configure, m =3...

Smoke [5.11.3] v5.11.3-99-g5747a2f FAIL(F) linux 2.6.31-16-generic [debian] (x86_64/8 cpu)
Automated smoke report for 5.11.3 patch 5747a2f6732071d6477abc45c2e06d557f1= a6c8a v5.11.3-99-g5747a2f zwei: Intel(R) Core(TM) i7 CPU 920 @ 2.67GHz (GenuineIntel 1600MHz) (x86_64= /8 cpu) on linux - 2.6.31-16-generic [debian] using cc version 4.4.1 smoketime 8 hours 22 minutes (average 31 minutes 23 seconds) Summary: FAIL(F) O =3D OK F =3D Failure(s), extended report at the bottom X =3D Failure(s) under TEST but not under harness ? =3D still running or test results not (yet) available Build failures during: - =3D unknown or N/A c =3D Configure, m =...

Smoke [5.11.3] v5.11.3-92-g91152fc FAIL(F) linux 2.6.31-16-generic [debian] (x86_64/8 cpu)
Automated smoke report for 5.11.3 patch 91152fc19d1c59a1213e39f74ac8a80f4a0= 15f5e v5.11.3-92-g91152fc zwei: Intel(R) Core(TM) i7 CPU 920 @ 2.67GHz (GenuineIntel 1600MHz) (x86_64= /8 cpu) on linux - 2.6.31-16-generic [debian] using cc version 4.4.1 smoketime 8 hours 29 minutes (average 31 minutes 52 seconds) Summary: FAIL(F) O =3D OK F =3D Failure(s), extended report at the bottom X =3D Failure(s) under TEST but not under harness ? =3D still running or test results not (yet) available Build failures during: - =3D unknown or N/A c =3D Configure, m =...

Smoke [5.11.3] v5.11.3-94-ga57c668 FAIL(F) linux 2.6.31-16-generic [debian] (x86_64/8 cpu)
Automated smoke report for 5.11.3 patch a57c668520b9767f7a6c93e0a396cee792a= 98be5 v5.11.3-94-ga57c668 zwei: Intel(R) Core(TM) i7 CPU 920 @ 2.67GHz (GenuineIntel 2668MHz) (x86_64= /8 cpu) on linux - 2.6.31-16-generic [debian] using cc version 4.4.1 smoketime 8 hours 8 minutes (average 30 minutes 31 seconds) Summary: FAIL(F) O =3D OK F =3D Failure(s), extended report at the bottom X =3D Failure(s) under TEST but not under harness ? =3D still running or test results not (yet) available Build failures during: - =3D unknown or N/A c =3D Configure, m =3...

Smoke [5.11.3] v5.11.3-127-g1f15e67 FAIL(F) linux 2.6.31-17-generic [debian] (x86_64/8 cpu)
Automated smoke report for 5.11.3 patch 1f15e670edb515b744e9021b4a42a7955da= 83093 v5.11.3-127-g1f15e67 zwei: Intel(R) Core(TM) i7 CPU 920 @ 2.67GHz (GenuineIntel 2668MHz) (x86_64= /8 cpu) on linux - 2.6.31-17-generic [debian] using cc version 4.4.1 smoketime 7 hours 51 minutes (average 29 minutes 29 seconds) Summary: FAIL(F) O =3D OK F =3D Failure(s), extended report at the bottom X =3D Failure(s) under TEST but not under harness ? =3D still running or test results not (yet) available Build failures during: - =3D unknown or N/A c =3D Configure, m ...

Smoke [5.11.3] v5.11.3-4-g0111a78 FAIL(FM) linux 2.6.31-14-generic [debian] (x86_64/8 cpu)
Automated smoke report for 5.11.3 patch 0111a78fcc993bdfaa4b46112924c3a9751= ecfa5 v5.11.3-4-g0111a78 zwei: Intel(R) Core(TM) i7 CPU 920 @ 2.67GHz (GenuineIntel 1600MHz) (x86_64= /8 cpu) on linux - 2.6.31-14-generic [debian] using cc version 4.4.1 smoketime 7 hours 40 minutes (average 28 minutes 46 seconds) Summary: FAIL(FM) O =3D OK F =3D Failure(s), extended report at the bottom X =3D Failure(s) under TEST but not under harness ? =3D still running or test results not (yet) available Build failures during: - =3D unknown or N/A c =3D Configure, m =...

Smoke [5.11.3] v5.11.3-7-gc670e63 FAIL(F) linux 2.6.31-16-generic [debian] (x86_64/8 cpu)
Automated smoke report for 5.11.3 patch c670e63af2af3c154935c36a0c6fb77f614= af0bd v5.11.3-7-gc670e63 zwei: Intel(R) Core(TM) i7 CPU 920 @ 2.67GHz (GenuineIntel 1600MHz) (x86_64= /8 cpu) on linux - 2.6.31-16-generic [debian] using cc version 4.4.1 smoketime 8 hours 29 minutes (average 31 minutes 51 seconds) Summary: FAIL(F) O =3D OK F =3D Failure(s), extended report at the bottom X =3D Failure(s) under TEST but not under harness ? =3D still running or test results not (yet) available Build failures during: - =3D unknown or N/A c =3D Configure, m =3...

Smoke [5.11.3] v5.11.3-98-g83452f8 FAIL(F) linux 2.6.31-16-generic [debian] (x86_64/8 cpu)
Automated smoke report for 5.11.3 patch 83452f8ea6ad77da7b6d12f161eedb3db3e= 647f3 v5.11.3-98-g83452f8 zwei: Intel(R) Core(TM) i7 CPU 920 @ 2.67GHz (GenuineIntel 1600MHz) (x86_64= /8 cpu) on linux - 2.6.31-16-generic [debian] using cc version 4.4.1 smoketime 8 hours 45 minutes (average 32 minutes 50 seconds) Summary: FAIL(F) O =3D OK F =3D Failure(s), extended report at the bottom X =3D Failure(s) under TEST but not under harness ? =3D still running or test results not (yet) available Build failures during: - =3D unknown or N/A c =3D Configure, m =...

Web resources about - Smoke [5.11.3] v5.11.3-3-gc3c0aa2 FAIL(F) linux 2.6.31-14-generic [debian] (x86_64/8 cpu) - perl.perl5.porters

Resources last updated: 2/7/2016 5:25:27 AM