Smoke [5.11.3] v5.11.3-119-gc25e53b FAIL(FM) linux 2.6.31-17-generic [debian] (x86_64/8 cpu)

Automated smoke report for 5.11.3 patch c25e53bef71ab0f21ff2b53e7adf829f605=
eadad v5.11.3-119-gc25e53b
zwei: Intel(R) Core(TM) i7 CPU 920 @ 2.67GHz (GenuineIntel 1600MHz) (x86_64=
/8 cpu)
    on        linux - 2.6.31-17-generic [debian]
    using     cc version 4.4.1
    smoketime 9 hours 18 minutes (average 34 minutes 53 seconds)

Summary: FAIL(FM)

O =3D OK  F =3D Failure(s), extended report at the bottom
X =3D Failure(s) under TEST but not under harness
? =3D still running or test results not (yet) available
Build failures during:       - =3D unknown or N/A
c =3D Configure, m =3D make, M =3D make (after miniperl), t =3D make test-p=
rep

v5.11.3-119-gc25e53b  Configuration (common) none
----------- ---------------------------------------------------------
F F F F F F=20
F F F F F F -Duse64bitint
F F F F F F -Duselongdouble
F F F F F F -Dusemorebits
F F F F F F -Duseithreads
F F F F F F -Duseithreads -Duse64bitint
F F F F F F -Duseithreads -Duselongdouble
M - - F F F -Duseithreads -Dusemorebits
| | | | | +- LC_ALL =3D en_US.utf8 -DDEBUGGING
| | | | +--- PERLIO =3D perlio -DDEBUGGING
| | | +----- PERLIO =3D stdio  -DDEBUGGING
| | +------- LC_ALL =3D en_US.utf8
| +--------- PERLIO =3D perlio
+----------- PERLIO =3D stdio=20

Locally applied patches:
    SMOKEc25e53bef71ab0f21ff2b53e7adf829f605eadad

Failures: (common-args) none
[stdio/perlio/en_US.utf8]=20
[stdio/perlio/en_US.utf8] -DDEBUGGING
[stdio/perlio/en_US.utf8] -Duse64bitint
[stdio/perlio/en_US.utf8] -DDEBUGGING -Duse64bitint
[stdio/perlio/en_US.utf8] -Duseithreads
[stdio/perlio/en_US.utf8] -DDEBUGGING -Duseithreads
[stdio/perlio/en_US.utf8] -Duseithreads -Duse64bitint
[stdio/perlio/en_US.utf8] -DDEBUGGING -Duseithreads -Duse64bitint
    ../t/porting/test_bootstrap.t...............................FAILED
        69-70

[stdio/perlio] -Duselongdouble
[stdio/perlio] -Dusemorebits
    ../t/op/pack.t..............................................FAILED
        3934, 3936, 3939, 3941, 3944, 3946, 3949
        3951, 3954, 3956, 3984, 3986, 3989, 3991
        3994, 3996, 3999, 4001, 4004, 4006, 4310
        4320, 13566, 13568, 13570, 13572, 13574
        13577, 13732, 13734, 13736, 13738, 13740
        13743, 13746, 13749, 13752, 13755, 13758
        13761, 13764, 13767, 13770, 13773, 13776
        13779, 14374, 14380, 14383, 14389
    ../t/porting/test_bootstrap.t...............................FAILED
        69-70

[en_US.utf8] -Duselongdouble
[en_US.utf8] -Dusemorebits
    ../t/op/pack.t..............................................FAILED
        3934, 3936, 3939, 3941, 3944, 3946, 3949
        3951, 3954, 3956, 3984, 3986, 3989, 3991
        3994, 3996, 3999, 4001, 4004, 4006, 4310
        4320, 13566, 13568, 13570, 13572, 13574
        13577, 13580, 13583, 13586, 13589, 13592
        13595, 13598, 13601, 13604, 13607, 13610
        13613, 13616, 13619, 13732, 13734, 13736
        13738, 13740, 13743, 13746, 13749, 14374
        14380, 14383, 14389
    ../t/porting/test_bootstrap.t...............................FAILED
        69-70

[stdio/perlio/en_US.utf8] -DDEBUGGING -Duselongdouble
    ../t/op/pack.t..............................................FAILED
        3934, 3936, 3939, 3944, 3949, 3954, 3984
        3989, 3994, 3999, 4004, 13568, 13572, 13580
        13583, 13589, 13595, 13601, 13607, 13613
        13616, 13734, 13738, 13746, 13752, 13758
        13764, 13770, 13776, 13782, 14374, 14380
        14383, 14389
    ../t/porting/test_bootstrap.t...............................FAILED
        69-70

[stdio/perlio] -DDEBUGGING -Dusemorebits
    ../t/op/pack.t..............................................FAILED
        3934, 3936, 3939, 3944, 3949, 3954, 3984
        3989, 3994, 3999, 4004, 13568, 13572, 13580
        13583, 13589, 13595, 13601, 13607, 13613
        13619, 13734, 13738, 13746, 13752, 13758
        13764, 13770, 13776, 13782, 14374, 14380
        14383, 14389
    ../t/porting/test_bootstrap.t...............................FAILED
        69-70

[en_US.utf8] -DDEBUGGING -Dusemorebits
    ../t/op/pack.t..............................................FAILED
        3934, 3936, 3939, 3944, 3949, 3954, 3984
        3989, 3994, 3999, 4004, 13568, 13572, 13580
        13583, 13589, 13595, 13601, 13607, 13613
        13734, 13738, 13746, 13752, 13758, 13764
        13770, 13776, 14374, 14380, 14383, 14389
    ../t/porting/test_bootstrap.t...............................FAILED
        69-70

[stdio/perlio/en_US.utf8] -Duseithreads -Duselongdouble
    ../t/op/pack.t..............................................FAILED
        3934, 3936, 3939, 3944, 3949, 3954, 3984
        3989, 3994, 3999, 4004, 4310, 4320, 13566
        13577, 13732, 13743, 14374, 14380, 14383
        14389
    ../t/porting/test_bootstrap.t...............................FAILED
        69-70

[stdio/en_US.utf8] -DDEBUGGING -Duseithreads -Duselongdouble
[stdio/en_US.utf8] -DDEBUGGING -Duseithreads -Dusemorebits
    ../t/op/pack.t..............................................FAILED
        3934, 3939, 3944, 3949, 3954, 3984, 3989
        3994, 3999, 4004, 13566, 13732, 14374, 14380
        14383, 14389
    ../t/porting/test_bootstrap.t...............................FAILED
        69-70

[perlio] -DDEBUGGING -Duseithreads -Duselongdouble
[perlio] -DDEBUGGING -Duseithreads -Dusemorebits
    ../t/op/pack.t..............................................FAILED
        3934, 3939, 3944, 3949, 3954, 3984, 3989
        3994, 3999, 4004, 14374, 14380, 14383, 14389
    ../t/porting/test_bootstrap.t...............................FAILED
        69-70

[minitest] -Duseithreads -Dusemorebits
    t/run/fresh_perl................FAILED at test 76
    t/run/switchx...................FAILED--no leader found
    t/io/argv.......................FAILED--no leader found
    t/io/fs.........................FAILED--no leader found
    t/io/utf8.......................FAILED--expected 55 tests, saw 52
    t/re/pat........................FAILED--no leader found
    t/re/pat_advanced...............FAILED--no leader found
    t/re/pat_psycho.................FAILED--no leader found
    t/re/pat_re_eval................FAILED--no leader found
    t/re/pat_rt_report..............FAILED--no leader found
    t/re/pat_special_cc.............FAILED--no leader found
    t/re/reg_fold...................FAILED at test 2
    t/re/reg_mesg...................FAILED at test 43
    t/re/reg_posixcc................FAILED--non-zero wait status: 512
    t/re/regexp.....................FAILED at test 89
    t/re/regexp_noamp...............FAILED at test 89
    t/re/regexp_notrie..............FAILED at test 89
    t/re/regexp_qr..................FAILED at test 89
    t/re/regexp_qr_embed............FAILED at test 89
    t/re/regexp_trielist............FAILED at test 89
    t/re/regexp_unicode_prop........FAILED--no leader found
    t/re/uniprops...................FAILED--no leader found
    t/op/chdir......................FAILED--no leader found
    t/op/die........................FAILED at test 14
    t/op/fork.......................FAILED at test 10
    t/op/groups.....................FAILED--no leader found
    t/op/hash.......................FAILED--no leader found
    t/op/inccode-tie................FAILED--no leader found
    t/op/inccode....................FAILED--no leader found
    t/op/lc.........................FAILED--expected 93 tests, saw 25
    t/op/local......................FAILED at test 294
    t/op/magic......................FAILED at test 27
    t/op/method.....................FAILED--no leader found
    t/op/mkdir......................FAILED--no leader found
    t/op/my_stash...................FAILED--no leader found
    t/op/override...................FAILED at test 26
    t/op/pack.......................FAILED--no leader found
    t/op/readline...................FAILED--no leader found
    t/op/ref........................FAILED--expected 196 tests, saw 118
    t/op/smartmatch.................FAILED--no leader found
    t/op/split......................FAILED--no leader found
    t/op/sprintf2...................FAILED at test 1320
    t/op/stat.......................FAILED--no leader found
    t/op/switch.....................FAILED--expected 132 tests, saw 138
    t/op/taint......................FAILED--no leader found
    t/op/tie........................FAILED at test 2
    t/op/tiehandle..................FAILED--no leader found
    t/op/universal..................FAILED--no leader found
    t/op/utfhash....................FAILED--expected 99 tests, saw 38
    t/op/utftaint...................FAILED--no leader found
    t/uni/cache.....................FAILED--expected 1 tests, saw 0
    t/uni/class.....................FAILED--expected 10 tests, saw 0
    t/uni/fold......................FAILED--no leader found
    t/uni/lex_utf8..................FAILED--no leader found
    t/uni/lower.....................FAILED--no leader found
    t/uni/overload..................FAILED--expected 215 tests, saw 10
    t/uni/title.....................FAILED--no leader found
    t/uni/upper.....................FAILED--no leader found

Compiler messages(gcc):
try.c: In function =E2=80=98main=E2=80=99:
try.c:36: warning: ignoring return value of =E2=80=98pipe=E2=80=99, declare=
d with attribute warn_unused_result
try.c:37: warning: ignoring return value of =E2=80=98pipe=E2=80=99, declare=
d with attribute warn_unused_result
try.c:53: warning: ignoring return value of =E2=80=98write=E2=80=99, declar=
ed with attribute warn_unused_result
try.c:66: warning: ignoring return value of =E2=80=98write=E2=80=99, declar=
ed with attribute warn_unused_result
try.c:72: warning: ignoring return value of =E2=80=98write=E2=80=99, declar=
ed with attribute warn_unused_result
try.c:78: warning: ignoring return value of =E2=80=98read=E2=80=99, declare=
d with attribute warn_unused_result
perlio.c: In function =E2=80=98PerlIO_debug=E2=80=99:
perlio.c:517: warning: ignoring return value of =E2=80=98write=E2=80=99, de=
clared with attribute warn_unused_result
perlio.c: In function =E2=80=98S_more_refcounted_fds=E2=80=99:
perlio.c:2301: warning: ignoring return value of =E2=80=98write=E2=80=99, d=
eclared with attribute warn_unused_result
util.c: In function =E2=80=98S_write_no_mem=E2=80=99:
util.c:67: warning: ignoring return value of =E2=80=98write=E2=80=99, decla=
red with attribute warn_unused_result
sv.c: In function =E2=80=98Perl_sv_2pv_flags=E2=80=99:
sv.c:2769: warning: ignoring return value of =E2=80=98gcvt=E2=80=99, declar=
ed with attribute warn_unused_result
sv.c:2962: warning: ignoring return value of =E2=80=98gcvt=E2=80=99, declar=
ed with attribute warn_unused_result
sv.c: In function =E2=80=98Perl_sv_vcatpvfn=E2=80=99:
sv.c:9339: warning: ignoring return value of =E2=80=98gcvt=E2=80=99, declar=
ed with attribute warn_unused_result
sv.c:10144: warning: ignoring return value of =E2=80=98gcvt=E2=80=99, decla=
red with attribute warn_unused_result
doio.c: In function =E2=80=98Perl_nextargv=E2=80=99:
doio.c:870: warning: ignoring return value of =E2=80=98fchown=E2=80=99, dec=
lared with attribute warn_unused_result
doio.c: In function =E2=80=98S_exec_failed=E2=80=99:
doio.c:1380: warning: ignoring return value of =E2=80=98write=E2=80=99, dec=
lared with attribute warn_unused_result
Dumper.xs: In function =E2=80=98DD_dump=E2=80=99:
Dumper.xs:813: warning: format =E2=80=98%ld=E2=80=99 expects type =E2=80=98=
long int=E2=80=99, but argument 2 has type =E2=80=98U32=E2=80=99
Call.xs: In function =E2=80=98filter_call=E2=80=99:
Call.xs:63: warning: format =E2=80=98%d=E2=80=99 expects type =E2=80=98int=
=E2=80=99, but argument 3 has type =E2=80=98STRLEN=E2=80=99
Call.xs:63: warning: format =E2=80=98%d=E2=80=99 expects type =E2=80=98int=
=E2=80=99, but argument 5 has type =E2=80=98STRLEN=E2=80=99
Call.xs:100: warning: format =E2=80=98%d=E2=80=99 expects type =E2=80=98int=
=E2=80=99, but argument 4 has type =E2=80=98STRLEN=E2=80=99
Call.xs:156: warning: format =E2=80=98%d=E2=80=99 expects type =E2=80=98int=
=E2=80=99, but argument 3 has type =E2=80=98STRLEN=E2=80=99
Call.xs:175: warning: format =E2=80=98%d=E2=80=99 expects type =E2=80=98int=
=E2=80=99, but argument 4 has type =E2=80=98STRLEN=E2=80=99
sdbm.c: In function =E2=80=98makroom=E2=80=99:
sdbm.c:371: warning: ignoring return value of =E2=80=98write=E2=80=99, decl=
ared with attribute warn_unused_result
APItest.xs: In function =E2=80=98XS_XS__APItest_pmflag=E2=80=99:
APItest.xs:930: warning: =E2=80=98Perl_pmflag=E2=80=99 is deprecated (decla=
red at ../../proto.h:2613)
sv.c:2769: warning: ignoring return value of =E2=80=98qgcvt=E2=80=99, decla=
red with attribute warn_unused_result
sv.c:2962: warning: ignoring return value of =E2=80=98qgcvt=E2=80=99, decla=
red with attribute warn_unused_result
sv.c:10144: warning: ignoring return value of =E2=80=98qgcvt=E2=80=99, decl=
ared with attribute warn_unused_result
perlio.c:508: warning: ignoring return value of =E2=80=98write=E2=80=99, de=
clared with attribute warn_unused_result
perl.c: In function =E2=80=98S_init_tls_and_interp=E2=80=99:
perl.c:107: warning: ignoring return value of =E2=80=98write=E2=80=99, decl=
ared with attribute warn_unused_result
threads.xs: In function =E2=80=98S_ithread_create=E2=80=99:
threads.xs:701: warning: ignoring return value of =E2=80=98write=E2=80=99, =
declared with attribute warn_unused_result

--=20
Report by Test::Smoke v1.39 build 1235 running on perl 5.10.0
(Reporter v0.035 / Smoker v0.044)

0
perl
1/18/2010 8:41:00 AM
perl.perl5.porters 48132 articles. 1 followers. Follow

0 Replies
213 Views

Similar Articles

[PageSpeed] 37

Reply: