Smoke [5.11.3] v5.11.2-239-g7fbfac2 FAIL(F) linux 2.6.31-14-generic [debian] (x86_64/8 cpu)

Automated smoke report for 5.11.3 patch 7fbfac22006ccdfb8aed0395a917f789cfb=
748a0 v5.11.2-239-g7fbfac2
zwei: Intel(R) Core(TM) i7 CPU 920 @ 2.67GHz (GenuineIntel 1600MHz) (x86_64=
/8 cpu)
    on        linux - 2.6.31-14-generic [debian]
    using     cc version 4.4.1
    smoketime 8 hours 16 minutes (average 31 minutes)

Summary: FAIL(F)

O =3D OK  F =3D Failure(s), extended report at the bottom
X =3D Failure(s) under TEST but not under harness
? =3D still running or test results not (yet) available
Build failures during:       - =3D unknown or N/A
c =3D Configure, m =3D make, M =3D make (after miniperl), t =3D make test-p=
rep

v5.11.2-239-g7fbfac2  Configuration (common) none
----------- ---------------------------------------------------------
O O F O O F=20
O O F O O F -Duse64bitint
F F F F F F -Duselongdouble
F F F F F F -Dusemorebits
O O F O O F -Duseithreads
O O F O O F -Duseithreads -Duse64bitint
F F F F F F -Duseithreads -Duselongdouble
F F F F F F -Duseithreads -Dusemorebits
| | | | | +- LC_ALL =3D en_US.utf8 -DDEBUGGING
| | | | +--- PERLIO =3D perlio -DDEBUGGING
| | | +----- PERLIO =3D stdio  -DDEBUGGING
| | +------- LC_ALL =3D en_US.utf8
| +--------- PERLIO =3D perlio
+----------- PERLIO =3D stdio=20

Locally applied patches:
    SMOKE7fbfac22006ccdfb8aed0395a917f789cfb748a0

Failures: (common-args) none
[en_US.utf8]=20
[en_US.utf8] -DDEBUGGING
[en_US.utf8] -Duse64bitint
[en_US.utf8] -DDEBUGGING -Duse64bitint
[en_US.utf8] -Duseithreads
[en_US.utf8] -DDEBUGGING -Duseithreads
[en_US.utf8] -Duseithreads -Duse64bitint
[en_US.utf8] -DDEBUGGING -Duseithreads -Duse64bitint
    ../t/porting/diag.t.........................................FAILED

[stdio] -Duselongdouble
[stdio] -Dusemorebits
    ../t/op/pack.t..............................................FAILED
        3934, 3936, 3939, 3941, 3944, 3946, 3949
        3951, 3954, 3956, 3984, 3986, 3989, 3991
        3994, 3996, 3999, 4001, 4004, 4006, 4310
        4320, 13566, 13568, 13570, 13572, 13574
        13577, 13732, 13734, 13736, 13738, 13740
        13743, 13746, 13749, 13752, 13755, 13758
        13761, 13764, 13767, 13770, 13773, 13776
        13779, 14374, 14380, 14383, 14389

[perlio] -Duselongdouble
    ../t/op/pack.t..............................................FAILED
        3934, 3936, 3939, 3941, 3944, 3946, 3949
        3951, 3954, 3956, 3984, 3986, 3989, 3991
        3994, 3996, 3999, 4001, 4004, 4006, 4310
        4320, 13566, 13568, 13570, 13572, 13574
        13577, 13580, 13583, 13586, 13589, 13592
        13595, 13598, 13601, 13604, 13607, 13610
        13732, 13734, 13736, 13738, 13740, 13743
        13746, 13749, 13752, 13755, 13758, 13761
        14374, 14380, 14383, 14389

[en_US.utf8] -Duselongdouble
[en_US.utf8] -Dusemorebits
    ../t/op/pack.t..............................................FAILED
        3934, 3936, 3939, 3941, 3944, 3946, 3949
        3951, 3954, 3956, 3984, 3986, 3989, 3991
        3994, 3996, 3999, 4001, 4004, 4006, 4310
        4320, 13566, 13568, 13570, 13572, 13574
        13577, 13580, 13583, 13586, 13589, 13592
        13595, 13598, 13601, 13604, 13607, 13610
        13613, 13616, 13732, 13734, 13736, 13738
        13740, 13743, 13746, 13749, 13752, 13755
        13758, 13761, 13764, 13767, 13770, 13773
        13776, 13779, 13782, 14374, 14380, 14383
        14389
    ../t/porting/diag.t.........................................FAILED

[stdio] -DDEBUGGING -Duselongdouble
[stdio] -DDEBUGGING -Dusemorebits
    ../t/op/pack.t..............................................FAILED
        3934, 3936, 3939, 3944, 3949, 3954, 3984
        3989, 3994, 3999, 4004, 13568, 13572, 13580
        13583, 13589, 13595, 13601, 13607, 13613
        13616, 13734, 13738, 13746, 13752, 13758
        13764, 13770, 13776, 13782, 14374, 14380
        14383, 14389

[perlio] -DDEBUGGING -Duselongdouble
    ../t/op/pack.t..............................................FAILED
        3934, 3936, 3939, 3944, 3949, 3954, 3984
        3989, 3994, 3999, 4004, 13568, 13572, 13580
        13583, 13589, 13595, 13601, 13607, 13613
        13734, 13738, 13746, 13752, 13758, 13764
        13770, 13776, 14374, 14380, 14383, 14389

[en_US.utf8] -DDEBUGGING -Duselongdouble
    ../t/op/pack.t..............................................FAILED
        3934, 3936, 3939, 3944, 3949, 3954, 3984
        3989, 3994, 3999, 4004, 13568, 13572, 13580
        13583, 13589, 13595, 13601, 13607, 13613
        13619, 13734, 13738, 13746, 13752, 13758
        13764, 13770, 13776, 13782, 14374, 14380
        14383, 14389
    ../t/porting/diag.t.........................................FAILED

[perlio] -Dusemorebits
    ../t/op/pack.t..............................................FAILED
        3934, 3936, 3939, 3941, 3944, 3946, 3949
        3951, 3954, 3956, 3984, 3986, 3989, 3991
        3994, 3996, 3999, 4001, 4004, 4006, 4310
        4320, 13566, 13568, 13570, 13572, 13574
        13577, 13580, 13583, 13586, 13589, 13592
        13595, 13598, 13601, 13604, 13607, 13610
        13613, 13616, 13619, 13732, 13734, 13736
        13738, 13740, 13743, 13746, 13749, 13752
        13755, 13758, 13761, 13764, 13767, 13770
        13773, 13776, 13779, 13782, 13785, 14374
        14380, 14383, 14389

[perlio] -DDEBUGGING -Dusemorebits
    ../t/op/pack.t..............................................FAILED
        3934, 3936, 3939, 3944, 3949, 3954, 3984
        3989, 3994, 3999, 4004, 13568, 13572, 13580
        13583, 13589, 13595, 13601, 13607, 13613
        13619, 13734, 13738, 13746, 13752, 13758
        13764, 13770, 13776, 13782, 14374, 14380
        14383, 14389

[en_US.utf8] -DDEBUGGING -Dusemorebits
    ../t/op/pack.t..............................................FAILED
        3934, 3936, 3939, 3944, 3949, 3954, 3984
        3989, 3994, 3999, 4004, 13568, 13572, 13580
        13583, 13589, 13595, 13601, 13607, 13613
        13616, 13734, 13738, 13746, 13752, 13758
        13764, 13770, 13776, 13782, 14374, 14380
        14383, 14389
    ../t/porting/diag.t.........................................FAILED

[stdio/perlio] -Duseithreads -Duselongdouble
[stdio/perlio] -Duseithreads -Dusemorebits
    ../t/op/pack.t..............................................FAILED
        3934, 3936, 3939, 3944, 3949, 3954, 3984
        3989, 3994, 3999, 4004, 4310, 4320, 13566
        13577, 13732, 13743, 14374, 14380, 14383
        14389

[en_US.utf8] -Duseithreads -Duselongdouble
[en_US.utf8] -Duseithreads -Dusemorebits
    ../t/op/pack.t..............................................FAILED
        3934, 3936, 3939, 3944, 3949, 3954, 3984
        3989, 3994, 3999, 4004, 4310, 4320, 13566
        13577, 13732, 13743, 14374, 14380, 14383
        14389
    ../t/porting/diag.t.........................................FAILED

[stdio] -DDEBUGGING -Duseithreads -Duselongdouble
[stdio] -DDEBUGGING -Duseithreads -Dusemorebits
    ../t/op/pack.t..............................................FAILED
        3934, 3939, 3944, 3949, 3954, 3984, 3989
        3994, 3999, 4004, 13566, 13732, 14374, 14380
        14383, 14389

[perlio] -DDEBUGGING -Duseithreads -Duselongdouble
[perlio] -DDEBUGGING -Duseithreads -Dusemorebits
    ../t/op/pack.t..............................................FAILED
        3934, 3939, 3944, 3949, 3954, 3984, 3989
        3994, 3999, 4004, 14374, 14380, 14383, 14389

[en_US.utf8] -DDEBUGGING -Duseithreads -Duselongdouble
[en_US.utf8] -DDEBUGGING -Duseithreads -Dusemorebits
    ../t/op/pack.t..............................................FAILED
        3934, 3939, 3944, 3949, 3954, 3984, 3989
        3994, 3999, 4004, 13566, 13732, 14374, 14380
        14383, 14389
    ../t/porting/diag.t.........................................FAILED

Compiler messages(gcc):
try.c: In function =E2=80=98main=E2=80=99:
try.c:36: warning: ignoring return value of =E2=80=98pipe=E2=80=99, declare=
d with attribute warn_unused_result
try.c:37: warning: ignoring return value of =E2=80=98pipe=E2=80=99, declare=
d with attribute warn_unused_result
try.c:53: warning: ignoring return value of =E2=80=98write=E2=80=99, declar=
ed with attribute warn_unused_result
try.c:66: warning: ignoring return value of =E2=80=98write=E2=80=99, declar=
ed with attribute warn_unused_result
try.c:72: warning: ignoring return value of =E2=80=98write=E2=80=99, declar=
ed with attribute warn_unused_result
try.c:78: warning: ignoring return value of =E2=80=98read=E2=80=99, declare=
d with attribute warn_unused_result
perlio.c: In function =E2=80=98PerlIO_debug=E2=80=99:
perlio.c:517: warning: ignoring return value of =E2=80=98write=E2=80=99, de=
clared with attribute warn_unused_result
perlio.c: In function =E2=80=98S_more_refcounted_fds=E2=80=99:
perlio.c:2301: warning: ignoring return value of =E2=80=98write=E2=80=99, d=
eclared with attribute warn_unused_result
util.c: In function =E2=80=98S_write_no_mem=E2=80=99:
util.c:67: warning: ignoring return value of =E2=80=98write=E2=80=99, decla=
red with attribute warn_unused_result
sv.c: In function =E2=80=98Perl_sv_2pv_flags=E2=80=99:
sv.c:2769: warning: ignoring return value of =E2=80=98gcvt=E2=80=99, declar=
ed with attribute warn_unused_result
sv.c:2962: warning: ignoring return value of =E2=80=98gcvt=E2=80=99, declar=
ed with attribute warn_unused_result
sv.c: In function =E2=80=98Perl_sv_vcatpvfn=E2=80=99:
sv.c:9333: warning: ignoring return value of =E2=80=98gcvt=E2=80=99, declar=
ed with attribute warn_unused_result
sv.c:10138: warning: ignoring return value of =E2=80=98gcvt=E2=80=99, decla=
red with attribute warn_unused_result
doio.c: In function =E2=80=98Perl_nextargv=E2=80=99:
doio.c:870: warning: ignoring return value of =E2=80=98fchown=E2=80=99, dec=
lared with attribute warn_unused_result
doio.c: In function =E2=80=98S_exec_failed=E2=80=99:
doio.c:1380: warning: ignoring return value of =E2=80=98write=E2=80=99, dec=
lared with attribute warn_unused_result
Dumper.xs: In function =E2=80=98DD_dump=E2=80=99:
Dumper.xs:813: warning: format =E2=80=98%ld=E2=80=99 expects type =E2=80=98=
long int=E2=80=99, but argument 2 has type =E2=80=98U32=E2=80=99
Call.xs: In function =E2=80=98filter_call=E2=80=99:
Call.xs:63: warning: format =E2=80=98%d=E2=80=99 expects type =E2=80=98int=
=E2=80=99, but argument 3 has type =E2=80=98STRLEN=E2=80=99
Call.xs:63: warning: format =E2=80=98%d=E2=80=99 expects type =E2=80=98int=
=E2=80=99, but argument 5 has type =E2=80=98STRLEN=E2=80=99
Call.xs:100: warning: format =E2=80=98%d=E2=80=99 expects type =E2=80=98int=
=E2=80=99, but argument 4 has type =E2=80=98STRLEN=E2=80=99
Call.xs:156: warning: format =E2=80=98%d=E2=80=99 expects type =E2=80=98int=
=E2=80=99, but argument 3 has type =E2=80=98STRLEN=E2=80=99
Call.xs:175: warning: format =E2=80=98%d=E2=80=99 expects type =E2=80=98int=
=E2=80=99, but argument 4 has type =E2=80=98STRLEN=E2=80=99
sdbm.c: In function =E2=80=98makroom=E2=80=99:
sdbm.c:371: warning: ignoring return value of =E2=80=98write=E2=80=99, decl=
ared with attribute warn_unused_result
APItest.xs: In function =E2=80=98XS_XS__APItest_pmflag=E2=80=99:
APItest.xs:930: warning: =E2=80=98Perl_pmflag=E2=80=99 is deprecated (decla=
red at ../../proto.h:2608)
sv.c:2769: warning: ignoring return value of =E2=80=98qgcvt=E2=80=99, decla=
red with attribute warn_unused_result
sv.c:2962: warning: ignoring return value of =E2=80=98qgcvt=E2=80=99, decla=
red with attribute warn_unused_result
sv.c:10138: warning: ignoring return value of =E2=80=98qgcvt=E2=80=99, decl=
ared with attribute warn_unused_result
perlio.c:508: warning: ignoring return value of =E2=80=98write=E2=80=99, de=
clared with attribute warn_unused_result
perl.c: In function =E2=80=98S_init_tls_and_interp=E2=80=99:
perl.c:106: warning: ignoring return value of =E2=80=98write=E2=80=99, decl=
ared with attribute warn_unused_result
threads.xs: In function =E2=80=98S_ithread_create=E2=80=99:
threads.xs:701: warning: ignoring return value of =E2=80=98write=E2=80=99, =
declared with attribute warn_unused_result

--=20
Report by Test::Smoke v1.39 build 1235 running on perl 5.10.0
(Reporter v0.035 / Smoker v0.044)

0
perl
12/21/2009 11:44:00 AM
perl.perl5.porters 48138 articles. 1 followers. Follow

0 Replies
434 Views

Similar Articles

[PageSpeed] 47

Reply:

Similar Artilces:

Smoke [5.11.3] v5.11.3-5-g27bca32 FAIL(F) linux 2.6.31-14-generic [debian] (x86_64/8 cpu)
Automated smoke report for 5.11.3 patch 27bca3226281a592aed848b7e68ea50f273= 81dac v5.11.3-5-g27bca32 zwei: Intel(R) Core(TM) i7 CPU 920 @ 2.67GHz (GenuineIntel 1600MHz) (x86_64= /8 cpu) on linux - 2.6.31-14-generic [debian] using cc version 4.4.1 smoketime 8 hours 10 minutes (average 30 minutes 39 seconds) Summary: FAIL(F) O =3D OK F =3D Failure(s), extended report at the bottom X =3D Failure(s) under TEST but not under harness ? =3D still running or test results not (yet) available Build failures during: - =3D unknown or N/A c =3D Configure, m =3...

Smoke [5.11.3] v5.11.3-3-gc3c0aa2 FAIL(F) linux 2.6.31-14-generic [debian] (x86_64/8 cpu)
Automated smoke report for 5.11.3 patch c3c0aa283b73660f84ae7e190dcbbd607fa= cb512 v5.11.3-3-gc3c0aa2 zwei: Intel(R) Core(TM) i7 CPU 920 @ 2.67GHz (GenuineIntel 1600MHz) (x86_64= /8 cpu) on linux - 2.6.31-14-generic [debian] using cc version 4.4.1 smoketime 8 hours 20 minutes (average 31 minutes 16 seconds) Summary: FAIL(F) O =3D OK F =3D Failure(s), extended report at the bottom X =3D Failure(s) under TEST but not under harness ? =3D still running or test results not (yet) available Build failures during: - =3D unknown or N/A c =3D Configure, m =3...

Smoke [5.11.2] v5.11.2-182-gb417843 FAIL(F) linux 2.6.31-14-generic [debian] (x86_64/8 cpu)
Automated smoke report for 5.11.2 patch b4178430270dbe109e7609d0b50d6d54bf9= e95d8 v5.11.2-182-gb417843 zwei: Intel(R) Core(TM) i7 CPU 920 @ 2.67GHz (GenuineIntel 2668MHz) (x86_64= /8 cpu) on linux - 2.6.31-14-generic [debian] using cc version 4.4.1 smoketime 8 hours 15 minutes (average 30 minutes 57 seconds) Summary: FAIL(F) O =3D OK F =3D Failure(s), extended report at the bottom X =3D Failure(s) under TEST but not under harness ? =3D still running or test results not (yet) available Build failures during: - =3D unknown or N/A c =3D Configure, m ...

Smoke [5.11.2] v5.11.2-175-g9307c42 FAIL(F) linux 2.6.31-14-generic [debian] (x86_64/8 cpu)
Automated smoke report for 5.11.2 patch 9307c420fad2f6f5bd314f9ed66dd532887= 03e09 v5.11.2-175-g9307c42 zwei: Intel(R) Core(TM) i7 CPU 920 @ 2.67GHz (GenuineIntel 1600MHz) (x86_64= /8 cpu) on linux - 2.6.31-14-generic [debian] using cc version 4.4.1 smoketime 8 hours 7 minutes (average 30 minutes 29 seconds) Summary: FAIL(F) O =3D OK F =3D Failure(s), extended report at the bottom X =3D Failure(s) under TEST but not under harness ? =3D still running or test results not (yet) available Build failures during: - =3D unknown or N/A c =3D Configure, m =...

Smoke [5.11.2] v5.11.2-205-g60984f2 FAIL(F) linux 2.6.31-14-generic [debian] (x86_64/8 cpu)
Automated smoke report for 5.11.2 patch 60984f2fcd55c5a3b23a8abcf5049087f55= e5182 v5.11.2-205-g60984f2 zwei: Intel(R) Core(TM) i7 CPU 920 @ 2.67GHz (GenuineIntel 1600MHz) (x86_64= /8 cpu) on linux - 2.6.31-14-generic [debian] using cc version 4.4.1 smoketime 8 hours 30 minutes (average 31 minutes 54 seconds) Summary: FAIL(F) O =3D OK F =3D Failure(s), extended report at the bottom X =3D Failure(s) under TEST but not under harness ? =3D still running or test results not (yet) available Build failures during: - =3D unknown or N/A c =3D Configure, m ...

Smoke [5.11.2] v5.11.2-185-g7598291 FAIL(F) linux 2.6.31-14-generic [debian] (x86_64/8 cpu)
Automated smoke report for 5.11.2 patch 759829140078d44db25a91e0ffe11464897= ba65d v5.11.2-185-g7598291 zwei: Intel(R) Core(TM) i7 CPU 920 @ 2.67GHz (GenuineIntel 1600MHz) (x86_64= /8 cpu) on linux - 2.6.31-14-generic [debian] using cc version 4.4.1 smoketime 8 hours 15 minutes (average 30 minutes 59 seconds) Summary: FAIL(F) O =3D OK F =3D Failure(s), extended report at the bottom X =3D Failure(s) under TEST but not under harness ? =3D still running or test results not (yet) available Build failures during: - =3D unknown or N/A c =3D Configure, m ...

Smoke [5.11.2] v5.11.2-187-g3bc3c5b FAIL(F) linux 2.6.31-14-generic [debian] (x86_64/8 cpu)
Automated smoke report for 5.11.2 patch 3bc3c5beacd5fac2157b8441ce88ad169a9= bc6b0 v5.11.2-187-g3bc3c5b zwei: Intel(R) Core(TM) i7 CPU 920 @ 2.67GHz (GenuineIntel 2668MHz) (x86_64= /8 cpu) on linux - 2.6.31-14-generic [debian] using cc version 4.4.1 smoketime 8 hours 11 minutes (average 30 minutes 42 seconds) Summary: FAIL(F) O =3D OK F =3D Failure(s), extended report at the bottom X =3D Failure(s) under TEST but not under harness ? =3D still running or test results not (yet) available Build failures during: - =3D unknown or N/A c =3D Configure, m ...

Smoke [5.11.2] v5.11.2-194-g9c455b5 FAIL(F) linux 2.6.31-14-generic [debian] (x86_64/8 cpu)
Automated smoke report for 5.11.2 patch 9c455b5f163e0962c0e63797d9f7b55b3a8= d5276 v5.11.2-194-g9c455b5 zwei: Intel(R) Core(TM) i7 CPU 920 @ 2.67GHz (GenuineIntel 1600MHz) (x86_64= /8 cpu) on linux - 2.6.31-14-generic [debian] using cc version 4.4.1 smoketime 8 hours 24 minutes (average 31 minutes 30 seconds) Summary: FAIL(F) O =3D OK F =3D Failure(s), extended report at the bottom X =3D Failure(s) under TEST but not under harness ? =3D still running or test results not (yet) available Build failures during: - =3D unknown or N/A c =3D Configure, m ...

Smoke [5.11.3] v5.11.3-8-g5ef4d93 FAIL(F) linux 2.6.31-16-generic [debian] (x86_64/8 cpu)
Automated smoke report for 5.11.3 patch 5ef4d93ec97e5239010a45df06473288e04= f739a v5.11.3-8-g5ef4d93 zwei: Intel(R) Core(TM) i7 CPU 920 @ 2.67GHz (GenuineIntel 1600MHz) (x86_64= /8 cpu) on linux - 2.6.31-16-generic [debian] using cc version 4.4.1 smoketime 8 hours 33 minutes (average 32 minutes 5 seconds) Summary: FAIL(F) O =3D OK F =3D Failure(s), extended report at the bottom X =3D Failure(s) under TEST but not under harness ? =3D still running or test results not (yet) available Build failures during: - =3D unknown or N/A c =3D Configure, m =3D...

Smoke [5.11.2] v5.11.2-173-g229c593 FAIL(FM) linux 2.6.31-14-generic [debian] (x86_64/8 cpu)
Automated smoke report for 5.11.2 patch 229c5935ba2b931e7f367cc5b2706adeee5= 7ee47 v5.11.2-173-g229c593 zwei: Intel(R) Core(TM) i7 CPU 920 @ 2.67GHz (GenuineIntel 2668MHz) (x86_64= /8 cpu) on linux - 2.6.31-14-generic [debian] using cc version 4.4.1 smoketime 7 hours 43 minutes (average 28 minutes 60 seconds) Summary: FAIL(FM) O =3D OK F =3D Failure(s), extended report at the bottom X =3D Failure(s) under TEST but not under harness ? =3D still running or test results not (yet) available Build failures during: - =3D unknown or N/A c =3D Configure, m...

Smoke [5.11.2] v5.11.2-193-gecb3747 FAIL(FM) linux 2.6.31-14-generic [debian] (x86_64/8 cpu)
Automated smoke report for 5.11.2 patch ecb374736fc633d7a24b560c2afe20a3a3d= 9f069 v5.11.2-193-gecb3747 zwei: Intel(R) Core(TM) i7 CPU 920 @ 2.67GHz (GenuineIntel 2668MHz) (x86_64= /8 cpu) on linux - 2.6.31-14-generic [debian] using cc version 4.4.1 smoketime 8 hours 30 minutes (average 31 minutes 54 seconds) Summary: FAIL(FM) O =3D OK F =3D Failure(s), extended report at the bottom X =3D Failure(s) under TEST but not under harness ? =3D still running or test results not (yet) available Build failures during: - =3D unknown or N/A c =3D Configure, m...

Smoke [5.11.3] v5.11.3-87-g16610ad FAIL(F) linux 2.6.31-16-generic [debian] (x86_64/8 cpu)
Automated smoke report for 5.11.3 patch 16610ad906328dde8c0ce186f28478759b0= d03ba v5.11.3-87-g16610ad zwei: Intel(R) Core(TM) i7 CPU 920 @ 2.67GHz (GenuineIntel 1600MHz) (x86_64= /8 cpu) on linux - 2.6.31-16-generic [debian] using cc version 4.4.1 smoketime 7 hours 50 minutes (average 29 minutes 26 seconds) Summary: FAIL(F) O =3D OK F =3D Failure(s), extended report at the bottom X =3D Failure(s) under TEST but not under harness ? =3D still running or test results not (yet) available Build failures during: - =3D unknown or N/A c =3D Configure, m =...

Smoke [5.11.3] v5.11.3-86-g73afaec FAIL(F) linux 2.6.31-16-generic [debian] (x86_64/8 cpu)
Automated smoke report for 5.11.3 patch 73afaec9a8c17d03643a56b3842448c172a= 26285 v5.11.3-86-g73afaec zwei: Intel(R) Core(TM) i7 CPU 920 @ 2.67GHz (GenuineIntel 1600MHz) (x86_64= /8 cpu) on linux - 2.6.31-16-generic [debian] using cc version 4.4.1 smoketime 7 hours 49 minutes (average 29 minutes 20 seconds) Summary: FAIL(F) O =3D OK F =3D Failure(s), extended report at the bottom X =3D Failure(s) under TEST but not under harness ? =3D still running or test results not (yet) available Build failures during: - =3D unknown or N/A c =3D Configure, m =...

Smoke [5.11.3] v5.11.3-91-g32709fd FAIL(F) linux 2.6.31-16-generic [debian] (x86_64/8 cpu)
Automated smoke report for 5.11.3 patch 32709fdf41543f067562e0dc9944448dd11= d2c28 v5.11.3-91-g32709fd zwei: Intel(R) Core(TM) i7 CPU 920 @ 2.67GHz (GenuineIntel 2668MHz) (x86_64= /8 cpu) on linux - 2.6.31-16-generic [debian] using cc version 4.4.1 smoketime 8 hours 18 minutes (average 31 minutes 9 seconds) Summary: FAIL(F) O =3D OK F =3D Failure(s), extended report at the bottom X =3D Failure(s) under TEST but not under harness ? =3D still running or test results not (yet) available Build failures during: - =3D unknown or N/A c =3D Configure, m =3...

Web resources about - Smoke [5.11.3] v5.11.2-239-g7fbfac2 FAIL(F) linux 2.6.31-14-generic [debian] (x86_64/8 cpu) - perl.perl5.porters

Donald Trump Used in Terror Group Al-Shabaab’s Recruitment Video: WATCH
Donald Trump’s call to ban Muslims from entering the United States is used in a new recruitment video from Al Qaeda Somalia affiliate Al-Shabaab. ...

Saudi Arabia executes 47, including Shia cleric Nimr
Interior ministry says executed "terrorists" took part in attacks against residential and government buildings.

Indian security forces wind up operation after airbase attack
Xinhua Indian security forces wind up operation after airbase attack Xinhua Indian security force personnel stand outside an attacked Indian ...

Natalie Cole Dies At 65 After Years Of Health Struggles
Legendary singer Natalie Cole has died at 65. The daughter of Nat King Cole, who died when she was just 15, had a string of impressive hits in ...

The Latest: Man Killed by Officers While Holding Phone ID'ed
The Latest: Coroner identifies man killed by Las Vegas police while holding phone, not gun

Toshiba and Bill Nye take you behind the scenes for New Year's Eve in Times Square
It's 2016 now time seems to fly. On New Year's Eve many revelers around the world gathered in various locations including Sydney, London, Rio ...

New Year’s Resolutions For 2016? Here’s How To Keep Them
How many of us come up with a list of New Year’s resolutions every single year? Practically everyone of course, even if it’s just a few things ...

Bill Cosby, Bill Lynn and undue process
PROSECUTIONS ARE like snowflakes, no two the same. Sometimes, you have a low-profile drunken-driving case where the defendant is a first-time ...


McCaffrey tops off all-time great season by lifting Stanford to Rose Bowl title
Los Angeles Times McCaffrey tops off all-time great season by lifting Stanford to Rose Bowl title San Jose Mercury News By Greg Frazier. Daily ...

Resources last updated: 1/2/2016 5:45:07 PM