Smoke [5.11.1] v5.11.1-68-g34861f2 FAIL(XF) netbsd 5.0.1 (i386/1 cpu)

Automated smoke report for 5.11.1 patch 34861f291d6c548304b74dfc30ff27447f1b582f v5.11.1-68-g34861f2
p5netbsd: Intel 686-class (i386/1 cpu)
    on        netbsd - 5.0.1
    using     cc version 4.1.3 20080704 prerelease (NetBSD nb2 20081120)
    smoketime 6 hours 33 minutes (average 49 minutes 14 seconds)

Summary: FAIL(XF)

O = OK  F = Failure(s), extended report at the bottom
X = Failure(s) under TEST but not under harness
? = still running or test results not (yet) available
Build failures during:       - = unknown or N/A
c = Configure, m = make, M = make (after miniperl), t = make test-prep

v5.11.1-68-g34861f2  Configuration (common) none
----------- ---------------------------------------------------------
O O O O     
O O O O     -Duse64bitint
O F O O     -Duseithreads
X X X O     -Duseithreads -Duse64bitint
| | | +----- PERLIO = perlio -DDEBUGGING
| | +------- PERLIO = stdio  -DDEBUGGING
| +--------- PERLIO = perlio
+----------- PERLIO = stdio


Locally applied patches:
    SMOKE34861f291d6c548304b74dfc30ff27447f1b582f

Failures: (common-args) none
[perlio] -Duseithreads
    ../lib/Benchmark.t..........................................FAILED
        126-127

[stdio/perlio] -Duseithreads -Duse64bitint
Inconsistent test results (between TEST and harness):
    ../lib/Benchmark.t......................FAILED at test 127

[stdio] -DDEBUGGING -Duseithreads -Duse64bitint
Inconsistent test results (between TEST and harness):
    ../lib/Benchmark.t......................FAILED at test 126

Compiler messages(gcc):
perlio.c: In function 'PerlIOStdio_set_ptrcnt':
perlio.c:3442: warning: pointer targets in assignment differ in signedness
/usr/include/sys/cdefs_elf.h:67:20: error: missing binary operator before token "("
<command line>:1:1: warning: "TIME_HIRES_STAT" redefined
<command line>:1:1: warning: this is the location of the previous definition

-- 
Report by Test::Smoke v1.40 build 1242 running on perl 5.10.0
(Reporter v0.035 / Smoker v0.044)
0
stsc
10/28/2009 5:23:42 AM
perl.perl5.porters 47881 articles. 1 followers. Follow

0 Replies
640 Views

Similar Articles

[PageSpeed] 9

Reply:

Similar Artilces:

Smoke [5.11.1] v5.11.1-187-g968682b FAIL(XF) netbsd 5.0.1 (i386/1 cpu)
Automated smoke report for 5.11.1 patch 968682bce14e5963abd216113468bc07e01bce0f v5.11.1-187-g968682b p5netbsd: Intel 686-class (i386/1 cpu) on netbsd - 5.0.1 using cc version 4.1.3 20080704 prerelease (NetBSD nb2 20081120) smoketime 6 hours 42 minutes (average 50 minutes 21 seconds) Summary: FAIL(XF) O = OK F = Failure(s), extended report at the bottom X = Failure(s) under TEST but not under harness ? = still running or test results not (yet) available Build failures during: - = unknown or N/A c = Configure, m = make, M = make (after miniperl), t = ...

Smoke [5.11.1] v5.11.1-220-gccbe4e7 FAIL(XF) netbsd 5.0.1 (i386/1 cpu)
Automated smoke report for 5.11.1 patch ccbe4e7464622f4935b162dd08db9d73acfed504 v5.11.1-220-gccbe4e7 p5netbsd: Intel 686-class (i386/1 cpu) on netbsd - 5.0.1 using cc version 4.1.3 20080704 prerelease (NetBSD nb2 20081120) smoketime 6 hours 46 minutes (average 50 minutes 46 seconds) Summary: FAIL(XF) O = OK F = Failure(s), extended report at the bottom X = Failure(s) under TEST but not under harness ? = still running or test results not (yet) available Build failures during: - = unknown or N/A c = Configure, m = make, M = make (after miniperl), t = ...

Smoke [5.11.1] v5.11.1-225-ge69777c FAIL(XF) netbsd 5.0.1 (i386/1 cpu)
Automated smoke report for 5.11.1 patch e69777c1f1a5fd88505d2345bb3a27e8b7266a68 v5.11.1-225-ge69777c p5netbsd: Intel 686-class (i386/1 cpu) on netbsd - 5.0.1 using cc version 4.1.3 20080704 prerelease (NetBSD nb2 20081120) smoketime 6 hours 48 minutes (average 51 minutes 2 seconds) Summary: FAIL(XF) O = OK F = Failure(s), extended report at the bottom X = Failure(s) under TEST but not under harness ? = still running or test results not (yet) available Build failures during: - = unknown or N/A c = Configure, m = make, M = make (after miniperl), t = m...

Smoke [5.11.1] v5.11.1-62-g0abd0d7 FAIL(XF) netbsd 5.0.1 (i386/1 cpu)
Automated smoke report for 5.11.1 patch 0abd0d78a73da1c4d13b1c700526b7e5d03b32d4 v5.11.1-62-g0abd0d7 p5netbsd: Intel 686-class (i386/1 cpu) on netbsd - 5.0.1 using cc version 4.1.3 20080704 prerelease (NetBSD nb2 20081120) smoketime 6 hours 33 minutes (average 49 minutes 12 seconds) Summary: FAIL(XF) O = OK F = Failure(s), extended report at the bottom X = Failure(s) under TEST but not under harness ? = still running or test results not (yet) available Build failures during: - = unknown or N/A c = Configure, m = make, M = make (after miniperl), t = m...

Smoke [5.11.1] v5.11.1-227-gedb47d5 FAIL(XF) netbsd 5.0.1 (i386/1 cpu)
Automated smoke report for 5.11.1 patch edb47d5e45750eb7ab61981e15a22f43672ff4f4 v5.11.1-227-gedb47d5 p5netbsd: Intel 686-class (i386/1 cpu) on netbsd - 5.0.1 using cc version 4.1.3 20080704 prerelease (NetBSD nb2 20081120) smoketime 6 hours 42 minutes (average 50 minutes 20 seconds) Summary: FAIL(XF) O = OK F = Failure(s), extended report at the bottom X = Failure(s) under TEST but not under harness ? = still running or test results not (yet) available Build failures during: - = unknown or N/A c = Configure, m = make, M = make (after miniperl), t = ...

Smoke [5.11.1] v5.11.1-205-ga1248f1 FAIL(F) netbsd 5.0.1 (i386/1 cpu)
Automated smoke report for 5.11.1 patch a1248f17ffcfa8fe0e91df962317b46b81fc0ce5 v5.11.1-205-ga1248f1 p5netbsd: Intel 686-class (i386/1 cpu) on netbsd - 5.0.1 using cc version 4.1.3 20080704 prerelease (NetBSD nb2 20081120) smoketime 6 hours 36 minutes (average 49 minutes 32 seconds) Summary: FAIL(F) O = OK F = Failure(s), extended report at the bottom X = Failure(s) under TEST but not under harness ? = still running or test results not (yet) available Build failures during: - = unknown or N/A c = Configure, m = make, M = make (after miniperl), t = m...

Smoke [5.11.1] v5.11.1-88-ge2b41a3 FAIL(M) netbsd 5.0.1 (i386/1 cpu)
Automated smoke report for 5.11.1 patch e2b41a3faa25b7d6b71238dab354ecf08ab6ad12 v5.11.1-88-ge2b41a3 p5netbsd: Intel 686-class (i386/1 cpu) on netbsd - 5.0.1 using cc version 4.1.3 20080704 prerelease (NetBSD nb2 20081120) smoketime 7 hours 34 minutes (average 56 minutes 48 seconds) Summary: FAIL(M) O = OK F = Failure(s), extended report at the bottom X = Failure(s) under TEST but not under harness ? = still running or test results not (yet) available Build failures during: - = unknown or N/A c = Configure, m = make, M = make (after miniperl), t = ma...

Smoke [5.11.1] v5.11.1-167-g437d421 FAIL(F) netbsd 5.0.1 (i386/1 cpu)
Automated smoke report for 5.11.1 patch 437d4214522421889ca7657c5c9e7dc2f6d1ef7b v5.11.1-167-g437d421 p5netbsd: Intel 686-class (i386/1 cpu) on netbsd - 5.0.1 using cc version 4.1.3 20080704 prerelease (NetBSD nb2 20081120) smoketime 6 hours 43 minutes (average 50 minutes 25 seconds) Summary: FAIL(F) O = OK F = Failure(s), extended report at the bottom X = Failure(s) under TEST but not under harness ? = still running or test results not (yet) available Build failures during: - = unknown or N/A c = Configure, m = make, M = make (after miniperl), t = m...

Smoke [5.11.0] v5.11.0-17-g28e464f FAIL(XF) netbsd 5.0.1 (i386/1 cpu)
Automated smoke report for 5.11.0 patch 28e464fba839d02f376952199261fc8b7d58a0d8 v5.11.0-17-g28e464f p5netbsd: Intel 686-class (i386/1 cpu) on netbsd - 5.0.1 using cc version 4.1.3 20080704 prerelease (NetBSD nb2 20081120) smoketime 7 hours 52 minutes (average 59 minutes 3 seconds) Summary: FAIL(XF) O = OK F = Failure(s), extended report at the bottom X = Failure(s) under TEST but not under harness ? = still running or test results not (yet) available Build failures during: - = unknown or N/A c = Configure, m = make, M = make (after miniperl), t = ma...

Smoke [5.11.0] v5.11.0-49-g5b7d14f FAIL(XF) netbsd 5.0.1 (i386/1 cpu)
Automated smoke report for 5.11.0 patch 5b7d14ffe3988c7f70fd9dc76be9c44168d17a62 v5.11.0-49-g5b7d14f p5netbsd: Intel 686-class (i386/1 cpu) on netbsd - 5.0.1 using cc version 4.1.3 20080704 prerelease (NetBSD nb2 20081120) smoketime 8 hours 10 minutes (average 1 hour 1 minute) Summary: FAIL(XF) O = OK F = Failure(s), extended report at the bottom X = Failure(s) under TEST but not under harness ? = still running or test results not (yet) available Build failures during: - = unknown or N/A c = Configure, m = make, M = make (after miniperl), t = make te...

Smoke [5.11.3] v5.11.3-5-g27bca32 FAIL(XF) netbsd 5.0.1 (i386/1 cpu)
Automated smoke report for 5.11.3 patch 27bca3226281a592aed848b7e68ea50f27381dac v5.11.3-5-g27bca32 p5netbsd: Intel 686-class (i386/1 cpu) on netbsd - 5.0.1 using cc version 4.1.3 20080704 prerelease (NetBSD nb2 20081120) smoketime 6 hours 44 minutes (average 50 minutes 37 seconds) Summary: FAIL(XF) O = OK F = Failure(s), extended report at the bottom X = Failure(s) under TEST but not under harness ? = still running or test results not (yet) available Build failures during: - = unknown or N/A c = Configure, m = make, M = make (after miniperl), t = ma...

Smoke [5.11.3] v5.11.3-108-gcb4a303 FAIL(XF) netbsd 5.0.1 (i386/1 cpu)
Automated smoke report for 5.11.3 patch cb4a303650e05576b6797aaca1373576a2f37af7 v5.11.3-108-gcb4a303 p5netbsd: Intel 686-class (i386/1 cpu) on netbsd - 5.0.1 using cc version 4.1.3 20080704 prerelease (NetBSD nb2 20081120) smoketime 6 hours 37 minutes (average 49 minutes 40 seconds) Summary: FAIL(XF) O = OK F = Failure(s), extended report at the bottom X = Failure(s) under TEST but not under harness ? = still running or test results not (yet) available Build failures during: - = unknown or N/A c = Configure, m = make, M = make (after miniperl), t = ...

Smoke [5.11.3] v5.11.3-98-g83452f8 FAIL(XF) netbsd 5.0.1 (i386/1 cpu)
Automated smoke report for 5.11.3 patch 83452f8ea6ad77da7b6d12f161eedb3db3e647f3 v5.11.3-98-g83452f8 p5netbsd: Intel 686-class (i386/1 cpu) on netbsd - 5.0.1 using cc version 4.1.3 20080704 prerelease (NetBSD nb2 20081120) smoketime 6 hours 35 minutes (average 49 minutes 27 seconds) Summary: FAIL(XF) O = OK F = Failure(s), extended report at the bottom X = Failure(s) under TEST but not under harness ? = still running or test results not (yet) available Build failures during: - = unknown or N/A c = Configure, m = make, M = make (after miniperl), t = m...

Smoke [5.11.3] v5.11.3-42-g06fc686 FAIL(XF) netbsd 5.0.1 (i386/1 cpu)
Automated smoke report for 5.11.3 patch 06fc68671f70339bdc6ddf5b7367ae9db8b4cd2a v5.11.3-42-g06fc686 p5netbsd: Intel 686-class (i386/1 cpu) on netbsd - 5.0.1 using cc version 4.1.3 20080704 prerelease (NetBSD nb2 20081120) smoketime 6 hours 36 minutes (average 49 minutes 31 seconds) Summary: FAIL(XF) O = OK F = Failure(s), extended report at the bottom X = Failure(s) under TEST but not under harness ? = still running or test results not (yet) available Build failures during: - = unknown or N/A c = Configure, m = make, M = make (after miniperl), t = m...

Web resources about - Smoke [5.11.1] v5.11.1-68-g34861f2 FAIL(XF) netbsd 5.0.1 (i386/1 cpu) - perl.perl5.porters

Darth Vader Mask in Kylo Ren’s Possession; New ‘Force Awakens’ Theory Ponders How
Darth Vader’s mask is now owned by Kylo Ren. That much we know. With Vader’s charred helmet from Star Wars’ Return of the Jedi now in the possession ...

Jennifer Lawrence has one thing in common with the self-made millionaire she plays in her new movie
In an interview for her new movie "Joy," Jennifer Lawrence discussed the ways in which she identifies with self-made millionaire Joy Mangano, ...

Katherine Timpf Calls Hillary Clinton A ‘Fake-Feminist,’ Says She ‘Attacked And Shamed’ Husband’s Sexual ...
Hillary Clinton has been called out as a “fake-feminist” by Fox News contributor and writer Katherine Timpf. The feisty writer says that she ...

Bill Cosby's Accusers React to His Sexual Assault Charges
Some of Bill Cosby ‘s over 50 accusers are reacting to the news that he has been charged in one of the cases, Andrea Constand ‘s 2004 sexual ...

Apple Inc. To Pay Italy $348 Million To Settle Tax Fraud Probe – Country Still Claims Company Should ...
Apple Inc. has agreed to pay the country of Italy $348 million (318 million euros) to settle a tax fraud probe. The U.S. tech giant, along with ...

'Affluenza' teen Ethan Couch wins three-day stay of deportation
The Globe and Mail 'Affluenza' teen Ethan Couch wins three-day stay of deportation Sacramento Bee Ethan Couch and his mother were granted ...

Woman driving wrong way on Miami interstate kills 5 including self
AL.com Woman driving wrong way on Miami interstate kills 5 including self AL.com A woman driving the wrong way on Interstate 95 in Miami struck ...

Pataki to drop out: report
The former New York governor has lagged at near zero percent in polls.

Facebook must face shareholder class actions over IPO
By Jonathan Stempel NEW YORK (Reuters) - A federal judge has certified two shareholder class actions accusing Facebook Inc of hiding concerns ...

17 million under flood warning as Mississippi River expected to reach highest crest since 1993
While some areas of the country are still suffering under drought conditions, unusually heavy rains in other regions are causing deadly flooding ...

Resources last updated: 12/30/2015 6:18:35 PM