Smoke [5.11.1] v5.11.1-62-g0abd0d7 FAIL(XF) netbsd 5.0.1 (i386/1 cpu)

Automated smoke report for 5.11.1 patch 0abd0d78a73da1c4d13b1c700526b7e5d03b32d4 v5.11.1-62-g0abd0d7
p5netbsd: Intel 686-class (i386/1 cpu)
    on        netbsd - 5.0.1
    using     cc version 4.1.3 20080704 prerelease (NetBSD nb2 20081120)
    smoketime 6 hours 33 minutes (average 49 minutes 12 seconds)

Summary: FAIL(XF)

O = OK  F = Failure(s), extended report at the bottom
X = Failure(s) under TEST but not under harness
? = still running or test results not (yet) available
Build failures during:       - = unknown or N/A
c = Configure, m = make, M = make (after miniperl), t = make test-prep

v5.11.1-62-g0abd0d7  Configuration (common) none
----------- ---------------------------------------------------------
O O O O     
O O O O     -Duse64bitint
O X O O     -Duseithreads
F O O O     -Duseithreads -Duse64bitint
| | | +----- PERLIO = perlio -DDEBUGGING
| | +------- PERLIO = stdio  -DDEBUGGING
| +--------- PERLIO = perlio
+----------- PERLIO = stdio


Locally applied patches:
    SMOKE0abd0d78a73da1c4d13b1c700526b7e5d03b32d4

Failures: (common-args) none
[perlio] -Duseithreads
Inconsistent test results (between TEST and harness):
    ../lib/Benchmark.t......................FAILED at test 126

[stdio] -Duseithreads -Duse64bitint
    ../lib/Benchmark.t..........................................FAILED
        13, 126-127

Compiler messages(gcc):
perlio.c: In function 'PerlIOStdio_set_ptrcnt':
perlio.c:3442: warning: pointer targets in assignment differ in signedness
/usr/include/sys/cdefs_elf.h:67:20: error: missing binary operator before token "("
<command line>:1:1: warning: "TIME_HIRES_STAT" redefined
<command line>:1:1: warning: this is the location of the previous definition

-- 
Report by Test::Smoke v1.40 build 1242 running on perl 5.10.0
(Reporter v0.035 / Smoker v0.044)
0
stsc
10/26/2009 5:24:31 AM
perl.perl5.porters 47889 articles. 1 followers. Follow

0 Replies
569 Views

Similar Articles

[PageSpeed] 12

Reply:

Similar Artilces:

Smoke [5.11.1] v5.11.1-220-gccbe4e7 FAIL(XF) netbsd 5.0.1 (i386/1 cpu)
Automated smoke report for 5.11.1 patch ccbe4e7464622f4935b162dd08db9d73acfed504 v5.11.1-220-gccbe4e7 p5netbsd: Intel 686-class (i386/1 cpu) on netbsd - 5.0.1 using cc version 4.1.3 20080704 prerelease (NetBSD nb2 20081120) smoketime 6 hours 46 minutes (average 50 minutes 46 seconds) Summary: FAIL(XF) O = OK F = Failure(s), extended report at the bottom X = Failure(s) under TEST but not under harness ? = still running or test results not (yet) available Build failures during: - = unknown or N/A c = Configure, m = make, M = make (after miniperl), t = ...

Smoke [5.11.1] v5.11.1-187-g968682b FAIL(XF) netbsd 5.0.1 (i386/1 cpu)
Automated smoke report for 5.11.1 patch 968682bce14e5963abd216113468bc07e01bce0f v5.11.1-187-g968682b p5netbsd: Intel 686-class (i386/1 cpu) on netbsd - 5.0.1 using cc version 4.1.3 20080704 prerelease (NetBSD nb2 20081120) smoketime 6 hours 42 minutes (average 50 minutes 21 seconds) Summary: FAIL(XF) O = OK F = Failure(s), extended report at the bottom X = Failure(s) under TEST but not under harness ? = still running or test results not (yet) available Build failures during: - = unknown or N/A c = Configure, m = make, M = make (after miniperl), t = ...

Smoke [5.11.1] v5.11.1-68-g34861f2 FAIL(XF) netbsd 5.0.1 (i386/1 cpu)
Automated smoke report for 5.11.1 patch 34861f291d6c548304b74dfc30ff27447f1b582f v5.11.1-68-g34861f2 p5netbsd: Intel 686-class (i386/1 cpu) on netbsd - 5.0.1 using cc version 4.1.3 20080704 prerelease (NetBSD nb2 20081120) smoketime 6 hours 33 minutes (average 49 minutes 14 seconds) Summary: FAIL(XF) O = OK F = Failure(s), extended report at the bottom X = Failure(s) under TEST but not under harness ? = still running or test results not (yet) available Build failures during: - = unknown or N/A c = Configure, m = make, M = make (after miniperl), t = m...

Smoke [5.11.1] v5.11.1-227-gedb47d5 FAIL(XF) netbsd 5.0.1 (i386/1 cpu)
Automated smoke report for 5.11.1 patch edb47d5e45750eb7ab61981e15a22f43672ff4f4 v5.11.1-227-gedb47d5 p5netbsd: Intel 686-class (i386/1 cpu) on netbsd - 5.0.1 using cc version 4.1.3 20080704 prerelease (NetBSD nb2 20081120) smoketime 6 hours 42 minutes (average 50 minutes 20 seconds) Summary: FAIL(XF) O = OK F = Failure(s), extended report at the bottom X = Failure(s) under TEST but not under harness ? = still running or test results not (yet) available Build failures during: - = unknown or N/A c = Configure, m = make, M = make (after miniperl), t = ...

Smoke [5.11.1] v5.11.1-225-ge69777c FAIL(XF) netbsd 5.0.1 (i386/1 cpu)
Automated smoke report for 5.11.1 patch e69777c1f1a5fd88505d2345bb3a27e8b7266a68 v5.11.1-225-ge69777c p5netbsd: Intel 686-class (i386/1 cpu) on netbsd - 5.0.1 using cc version 4.1.3 20080704 prerelease (NetBSD nb2 20081120) smoketime 6 hours 48 minutes (average 51 minutes 2 seconds) Summary: FAIL(XF) O = OK F = Failure(s), extended report at the bottom X = Failure(s) under TEST but not under harness ? = still running or test results not (yet) available Build failures during: - = unknown or N/A c = Configure, m = make, M = make (after miniperl), t = m...

Smoke [5.11.1] v5.11.1-205-ga1248f1 FAIL(F) netbsd 5.0.1 (i386/1 cpu)
Automated smoke report for 5.11.1 patch a1248f17ffcfa8fe0e91df962317b46b81fc0ce5 v5.11.1-205-ga1248f1 p5netbsd: Intel 686-class (i386/1 cpu) on netbsd - 5.0.1 using cc version 4.1.3 20080704 prerelease (NetBSD nb2 20081120) smoketime 6 hours 36 minutes (average 49 minutes 32 seconds) Summary: FAIL(F) O = OK F = Failure(s), extended report at the bottom X = Failure(s) under TEST but not under harness ? = still running or test results not (yet) available Build failures during: - = unknown or N/A c = Configure, m = make, M = make (after miniperl), t = m...

Smoke [5.11.1] v5.11.1-88-ge2b41a3 FAIL(M) netbsd 5.0.1 (i386/1 cpu)
Automated smoke report for 5.11.1 patch e2b41a3faa25b7d6b71238dab354ecf08ab6ad12 v5.11.1-88-ge2b41a3 p5netbsd: Intel 686-class (i386/1 cpu) on netbsd - 5.0.1 using cc version 4.1.3 20080704 prerelease (NetBSD nb2 20081120) smoketime 7 hours 34 minutes (average 56 minutes 48 seconds) Summary: FAIL(M) O = OK F = Failure(s), extended report at the bottom X = Failure(s) under TEST but not under harness ? = still running or test results not (yet) available Build failures during: - = unknown or N/A c = Configure, m = make, M = make (after miniperl), t = ma...

Smoke [5.11.1] v5.11.1-167-g437d421 FAIL(F) netbsd 5.0.1 (i386/1 cpu)
Automated smoke report for 5.11.1 patch 437d4214522421889ca7657c5c9e7dc2f6d1ef7b v5.11.1-167-g437d421 p5netbsd: Intel 686-class (i386/1 cpu) on netbsd - 5.0.1 using cc version 4.1.3 20080704 prerelease (NetBSD nb2 20081120) smoketime 6 hours 43 minutes (average 50 minutes 25 seconds) Summary: FAIL(F) O = OK F = Failure(s), extended report at the bottom X = Failure(s) under TEST but not under harness ? = still running or test results not (yet) available Build failures during: - = unknown or N/A c = Configure, m = make, M = make (after miniperl), t = m...

Smoke [5.11.0] v5.11.0-17-g28e464f FAIL(XF) netbsd 5.0.1 (i386/1 cpu)
Automated smoke report for 5.11.0 patch 28e464fba839d02f376952199261fc8b7d58a0d8 v5.11.0-17-g28e464f p5netbsd: Intel 686-class (i386/1 cpu) on netbsd - 5.0.1 using cc version 4.1.3 20080704 prerelease (NetBSD nb2 20081120) smoketime 7 hours 52 minutes (average 59 minutes 3 seconds) Summary: FAIL(XF) O = OK F = Failure(s), extended report at the bottom X = Failure(s) under TEST but not under harness ? = still running or test results not (yet) available Build failures during: - = unknown or N/A c = Configure, m = make, M = make (after miniperl), t = ma...

Smoke [5.11.0] v5.11.0-49-g5b7d14f FAIL(XF) netbsd 5.0.1 (i386/1 cpu)
Automated smoke report for 5.11.0 patch 5b7d14ffe3988c7f70fd9dc76be9c44168d17a62 v5.11.0-49-g5b7d14f p5netbsd: Intel 686-class (i386/1 cpu) on netbsd - 5.0.1 using cc version 4.1.3 20080704 prerelease (NetBSD nb2 20081120) smoketime 8 hours 10 minutes (average 1 hour 1 minute) Summary: FAIL(XF) O = OK F = Failure(s), extended report at the bottom X = Failure(s) under TEST but not under harness ? = still running or test results not (yet) available Build failures during: - = unknown or N/A c = Configure, m = make, M = make (after miniperl), t = make te...

Smoke [5.11.3] v5.11.3-5-g27bca32 FAIL(XF) netbsd 5.0.1 (i386/1 cpu)
Automated smoke report for 5.11.3 patch 27bca3226281a592aed848b7e68ea50f27381dac v5.11.3-5-g27bca32 p5netbsd: Intel 686-class (i386/1 cpu) on netbsd - 5.0.1 using cc version 4.1.3 20080704 prerelease (NetBSD nb2 20081120) smoketime 6 hours 44 minutes (average 50 minutes 37 seconds) Summary: FAIL(XF) O = OK F = Failure(s), extended report at the bottom X = Failure(s) under TEST but not under harness ? = still running or test results not (yet) available Build failures during: - = unknown or N/A c = Configure, m = make, M = make (after miniperl), t = ma...

Smoke [5.11.3] v5.11.3-108-gcb4a303 FAIL(XF) netbsd 5.0.1 (i386/1 cpu)
Automated smoke report for 5.11.3 patch cb4a303650e05576b6797aaca1373576a2f37af7 v5.11.3-108-gcb4a303 p5netbsd: Intel 686-class (i386/1 cpu) on netbsd - 5.0.1 using cc version 4.1.3 20080704 prerelease (NetBSD nb2 20081120) smoketime 6 hours 37 minutes (average 49 minutes 40 seconds) Summary: FAIL(XF) O = OK F = Failure(s), extended report at the bottom X = Failure(s) under TEST but not under harness ? = still running or test results not (yet) available Build failures during: - = unknown or N/A c = Configure, m = make, M = make (after miniperl), t = ...

Smoke [5.11.3] v5.11.3-98-g83452f8 FAIL(XF) netbsd 5.0.1 (i386/1 cpu)
Automated smoke report for 5.11.3 patch 83452f8ea6ad77da7b6d12f161eedb3db3e647f3 v5.11.3-98-g83452f8 p5netbsd: Intel 686-class (i386/1 cpu) on netbsd - 5.0.1 using cc version 4.1.3 20080704 prerelease (NetBSD nb2 20081120) smoketime 6 hours 35 minutes (average 49 minutes 27 seconds) Summary: FAIL(XF) O = OK F = Failure(s), extended report at the bottom X = Failure(s) under TEST but not under harness ? = still running or test results not (yet) available Build failures during: - = unknown or N/A c = Configure, m = make, M = make (after miniperl), t = m...

Smoke [5.11.3] v5.11.3-42-g06fc686 FAIL(XF) netbsd 5.0.1 (i386/1 cpu)
Automated smoke report for 5.11.3 patch 06fc68671f70339bdc6ddf5b7367ae9db8b4cd2a v5.11.3-42-g06fc686 p5netbsd: Intel 686-class (i386/1 cpu) on netbsd - 5.0.1 using cc version 4.1.3 20080704 prerelease (NetBSD nb2 20081120) smoketime 6 hours 36 minutes (average 49 minutes 31 seconds) Summary: FAIL(XF) O = OK F = Failure(s), extended report at the bottom X = Failure(s) under TEST but not under harness ? = still running or test results not (yet) available Build failures during: - = unknown or N/A c = Configure, m = make, M = make (after miniperl), t = m...

Web resources about - Smoke [5.11.1] v5.11.1-62-g0abd0d7 FAIL(XF) netbsd 5.0.1 (i386/1 cpu) - perl.perl5.porters

More than 100 homes lost in Australia's Christmas Day bushfires
Reuters More than 100 homes lost in Australia's Christmas Day bushfires Reuters MELBOURNE More than 100 homes burned down in a leading Australia ...

A courageous gesture by Modi in Lahore, but it is not yet clear where it will lead - Firstpost
Prime Minister Narendra Modi’s decision to stopover in Lahore has echoes of former Prime Minister Atal Bihari Vajpayee’s Pakistan diplomacy. ...

Top Syrian rebel leader killed in air strike in Damascus suburb
By Suleiman Al-Khalidi BEIRUT (Reuters) - A top Syrian rebel leader and head of the most powerful insurgent group in the eastern suburbs of Damascus ...

Iraqi Forces Advance Into The Heart Of Ramadi, Abadi Eyes Mosul As Next Target
In a move likely to assist in rehabilitating the heavily compromised reputation of the Iraqi military, Iraqi forces with US air support are successfully ...

Late-night earthquake rattles Pakistani capital, Afghanistan
A strong earthquake shook parts of Pakistan and Afghanistan early Saturday, rattling buildings and forcing sleeping residents out of their homes. ...

Police investigating officer-involved shooting near Hayward BART; 1 suspect in ...
abc7news.com Police investigating officer-involved shooting near Hayward BART; 1 suspect in ... abc7news.com A BART police officer is being ...

Oops: UK astronaut Tim Peake calls wrong number from space
Anyone can dial a wrong number, but it's not often done from outer space.

Radiohead's James Bond Theme Song "Spectre" Released
Radiohead just released a new song! “Last year we were asked to write a theme tune for the [James] Bond movie Spectre ,” Radiohead singer Thom ...

Gigi Hadid Celebrates White Christmas with Family
Gigi Hadid celebrates a dreamy white Christmas atop snow slopes with her family – mom Yolanda Foster , sister Bella Hadid , and brother Anwar ...

Are Donald Trump's poll numbers understated? - Business Insider Deutschland
Could Donald Trump be the 2016 version of a reverse "Bradley effect?"

Resources last updated: 12/26/2015 7:33:53 AM