Smoke [5.11.1] v5.11.1-167-g437d421 FAIL(F) netbsd 5.0.1 (i386/1 cpu)

Automated smoke report for 5.11.1 patch 437d4214522421889ca7657c5c9e7dc2f6d1ef7b v5.11.1-167-g437d421
p5netbsd: Intel 686-class (i386/1 cpu)
    on        netbsd - 5.0.1
    using     cc version 4.1.3 20080704 prerelease (NetBSD nb2 20081120)
    smoketime 6 hours 43 minutes (average 50 minutes 25 seconds)

Summary: FAIL(F)

O = OK  F = Failure(s), extended report at the bottom
X = Failure(s) under TEST but not under harness
? = still running or test results not (yet) available
Build failures during:       - = unknown or N/A
c = Configure, m = make, M = make (after miniperl), t = make test-prep

v5.11.1-167-g437d421  Configuration (common) none
----------- ---------------------------------------------------------
F F F F     
F F F F     -Duse64bitint
F F F F     -Duseithreads
F F F F     -Duseithreads -Duse64bitint
| | | +----- PERLIO = perlio -DDEBUGGING
| | +------- PERLIO = stdio  -DDEBUGGING
| +--------- PERLIO = perlio
+----------- PERLIO = stdio


Locally applied patches:
    SMOKE437d4214522421889ca7657c5c9e7dc2f6d1ef7b

Failures: (common-args) none
[stdio/perlio] 
[perlio] -DDEBUGGING
[stdio/perlio] -Duse64bitint
[stdio] -Duseithreads
[stdio/perlio] -DDEBUGGING -Duseithreads
[stdio/perlio] -Duseithreads -Duse64bitint
[stdio/perlio] -DDEBUGGING -Duseithreads -Duse64bitint
    ../t/porting/diag.t.........................................FAILED
        92

[stdio] -DDEBUGGING
[stdio/perlio] -DDEBUGGING -Duse64bitint
    ../t/porting/diag.t.........................................FAILED
        92
Inconsistent test results (between TEST and harness):
    ../lib/Benchmark.t......................FAILED at test 127

[perlio] -Duseithreads
    ../t/porting/diag.t.........................................FAILED
        92
Inconsistent test results (between TEST and harness):
    ../lib/Benchmark.t......................FAILED at test 126

Compiler messages(gcc):
pp.c: In function 'Perl_pp_delete':
pp.c:4297: warning: 'sv' may be used uninitialized in this function
pp_ctl.c: In function 'Perl_pp_last':
pp_ctl.c:2214: warning: 'nextop' may be used uninitialized in this function
pp_ctl.c: In function 'Perl_pp_return':
pp_ctl.c:2092: warning: 'retop' may be used uninitialized in this function
pp_sys.c: In function 'Perl_pp_dbmopen':
pp_sys.c:936: warning: 'gv' may be used uninitialized in this function
pp_sys.c: In function 'Perl_pp_tie':
pp_sys.c:788: warning: 'gv' may be used uninitialized in this function
perlio.c: In function 'PerlIOStdio_set_ptrcnt':
perlio.c:3437: warning: pointer targets in assignment differ in signedness
/usr/include/sys/cdefs_elf.h:67:20: error: missing binary operator before token "("
<command line>:1:1: warning: "TIME_HIRES_STAT" redefined
<command line>:1:1: warning: this is the location of the previous definition
APItest.xs: In function 'XS_XS__APItest_pmflag':
APItest.xs:930: warning: 'Perl_pmflag' is deprecated (declared at ../../proto.h:2517)
op.c: In function 'Perl_newATTRSUB':
op.c:5777: warning: cast from pointer to integer of different size

-- 
Report by Test::Smoke v1.40 build 1242 running on perl 5.10.0
(Reporter v0.035 / Smoker v0.044)
0
stsc
11/11/2009 5:36:54 AM
perl.perl5.porters 47867 articles. 1 followers. Follow

0 Replies
773 Views

Similar Articles

[PageSpeed] 46

Reply:

Similar Artilces:

Smoke [5.11.1] v5.11.1-205-ga1248f1 FAIL(F) netbsd 5.0.1 (i386/1 cpu)
Automated smoke report for 5.11.1 patch a1248f17ffcfa8fe0e91df962317b46b81fc0ce5 v5.11.1-205-ga1248f1 p5netbsd: Intel 686-class (i386/1 cpu) on netbsd - 5.0.1 using cc version 4.1.3 20080704 prerelease (NetBSD nb2 20081120) smoketime 6 hours 36 minutes (average 49 minutes 32 seconds) Summary: FAIL(F) O = OK F = Failure(s), extended report at the bottom X = Failure(s) under TEST but not under harness ? = still running or test results not (yet) available Build failures during: - = unknown or N/A c = Configure, m = make, M = make (after miniperl), t = m...

Smoke [5.11.1] v5.11.1-88-ge2b41a3 FAIL(M) netbsd 5.0.1 (i386/1 cpu)
Automated smoke report for 5.11.1 patch e2b41a3faa25b7d6b71238dab354ecf08ab6ad12 v5.11.1-88-ge2b41a3 p5netbsd: Intel 686-class (i386/1 cpu) on netbsd - 5.0.1 using cc version 4.1.3 20080704 prerelease (NetBSD nb2 20081120) smoketime 7 hours 34 minutes (average 56 minutes 48 seconds) Summary: FAIL(M) O = OK F = Failure(s), extended report at the bottom X = Failure(s) under TEST but not under harness ? = still running or test results not (yet) available Build failures during: - = unknown or N/A c = Configure, m = make, M = make (after miniperl), t = ma...

Smoke [5.11.1] v5.11.1-227-gedb47d5 FAIL(XF) netbsd 5.0.1 (i386/1 cpu)
Automated smoke report for 5.11.1 patch edb47d5e45750eb7ab61981e15a22f43672ff4f4 v5.11.1-227-gedb47d5 p5netbsd: Intel 686-class (i386/1 cpu) on netbsd - 5.0.1 using cc version 4.1.3 20080704 prerelease (NetBSD nb2 20081120) smoketime 6 hours 42 minutes (average 50 minutes 20 seconds) Summary: FAIL(XF) O = OK F = Failure(s), extended report at the bottom X = Failure(s) under TEST but not under harness ? = still running or test results not (yet) available Build failures during: - = unknown or N/A c = Configure, m = make, M = make (after miniperl), t = ...

Smoke [5.11.1] v5.11.1-62-g0abd0d7 FAIL(XF) netbsd 5.0.1 (i386/1 cpu)
Automated smoke report for 5.11.1 patch 0abd0d78a73da1c4d13b1c700526b7e5d03b32d4 v5.11.1-62-g0abd0d7 p5netbsd: Intel 686-class (i386/1 cpu) on netbsd - 5.0.1 using cc version 4.1.3 20080704 prerelease (NetBSD nb2 20081120) smoketime 6 hours 33 minutes (average 49 minutes 12 seconds) Summary: FAIL(XF) O = OK F = Failure(s), extended report at the bottom X = Failure(s) under TEST but not under harness ? = still running or test results not (yet) available Build failures during: - = unknown or N/A c = Configure, m = make, M = make (after miniperl), t = m...

Smoke [5.11.1] v5.11.1-68-g34861f2 FAIL(XF) netbsd 5.0.1 (i386/1 cpu)
Automated smoke report for 5.11.1 patch 34861f291d6c548304b74dfc30ff27447f1b582f v5.11.1-68-g34861f2 p5netbsd: Intel 686-class (i386/1 cpu) on netbsd - 5.0.1 using cc version 4.1.3 20080704 prerelease (NetBSD nb2 20081120) smoketime 6 hours 33 minutes (average 49 minutes 14 seconds) Summary: FAIL(XF) O = OK F = Failure(s), extended report at the bottom X = Failure(s) under TEST but not under harness ? = still running or test results not (yet) available Build failures during: - = unknown or N/A c = Configure, m = make, M = make (after miniperl), t = m...

Smoke [5.11.1] v5.11.1-187-g968682b FAIL(XF) netbsd 5.0.1 (i386/1 cpu)
Automated smoke report for 5.11.1 patch 968682bce14e5963abd216113468bc07e01bce0f v5.11.1-187-g968682b p5netbsd: Intel 686-class (i386/1 cpu) on netbsd - 5.0.1 using cc version 4.1.3 20080704 prerelease (NetBSD nb2 20081120) smoketime 6 hours 42 minutes (average 50 minutes 21 seconds) Summary: FAIL(XF) O = OK F = Failure(s), extended report at the bottom X = Failure(s) under TEST but not under harness ? = still running or test results not (yet) available Build failures during: - = unknown or N/A c = Configure, m = make, M = make (after miniperl), t = ...

Smoke [5.11.1] v5.11.1-220-gccbe4e7 FAIL(XF) netbsd 5.0.1 (i386/1 cpu)
Automated smoke report for 5.11.1 patch ccbe4e7464622f4935b162dd08db9d73acfed504 v5.11.1-220-gccbe4e7 p5netbsd: Intel 686-class (i386/1 cpu) on netbsd - 5.0.1 using cc version 4.1.3 20080704 prerelease (NetBSD nb2 20081120) smoketime 6 hours 46 minutes (average 50 minutes 46 seconds) Summary: FAIL(XF) O = OK F = Failure(s), extended report at the bottom X = Failure(s) under TEST but not under harness ? = still running or test results not (yet) available Build failures during: - = unknown or N/A c = Configure, m = make, M = make (after miniperl), t = ...

Smoke [5.11.1] v5.11.1-225-ge69777c FAIL(XF) netbsd 5.0.1 (i386/1 cpu)
Automated smoke report for 5.11.1 patch e69777c1f1a5fd88505d2345bb3a27e8b7266a68 v5.11.1-225-ge69777c p5netbsd: Intel 686-class (i386/1 cpu) on netbsd - 5.0.1 using cc version 4.1.3 20080704 prerelease (NetBSD nb2 20081120) smoketime 6 hours 48 minutes (average 51 minutes 2 seconds) Summary: FAIL(XF) O = OK F = Failure(s), extended report at the bottom X = Failure(s) under TEST but not under harness ? = still running or test results not (yet) available Build failures during: - = unknown or N/A c = Configure, m = make, M = make (after miniperl), t = m...

Smoke [5.11.0] v5.11.0-231-g8f3d599 FAIL(F) netbsd 5.0.1 (i386/1 cpu)
Automated smoke report for 5.11.0 patch 8f3d5996a665cf70e12a836b95e184e9ab628251 v5.11.0-231-g8f3d599 p5netbsd: Intel 686-class (i386/1 cpu) on netbsd - 5.0.1 using cc version 4.1.3 20080704 prerelease (NetBSD nb2 20081120) smoketime 6 hours 31 minutes (average 48 minutes 55 seconds) Summary: FAIL(F) O = OK F = Failure(s), extended report at the bottom X = Failure(s) under TEST but not under harness ? = still running or test results not (yet) available Build failures during: - = unknown or N/A c = Configure, m = make, M = make (after miniperl), t = m...

Smoke [5.11.0] v5.11.0-54-g68cbce5 FAIL(F) netbsd 5.0.1 (i386/1 cpu)
Automated smoke report for 5.11.0 patch 68cbce50efee2c3ae424cfe29c83b65d5b462b69 v5.11.0-54-g68cbce5 p5netbsd: Intel 686-class (i386/1 cpu) on netbsd - 5.0.1 using cc version 4.1.3 20080704 prerelease (NetBSD nb2 20081120) smoketime 8 hours 24 minutes (average 1 hour 3 minutes) Summary: FAIL(F) O = OK F = Failure(s), extended report at the bottom X = Failure(s) under TEST but not under harness ? = still running or test results not (yet) available Build failures during: - = unknown or N/A c = Configure, m = make, M = make (after miniperl), t = make te...

Smoke [5.11.0] v5.11.0-187-g8dbe7cf FAIL(F) netbsd 5.0.1 (i386/1 cpu)
Automated smoke report for 5.11.0 patch 8dbe7cf704038839ade17963855cf8bfad0c30a3 v5.11.0-187-g8dbe7cf p5netbsd: Intel 686-class (i386/1 cpu) on netbsd - 5.0.1 using cc version 4.1.3 20080704 prerelease (NetBSD nb2 20081120) smoketime 6 hours 35 minutes (average 49 minutes 23 seconds) Summary: FAIL(F) O = OK F = Failure(s), extended report at the bottom X = Failure(s) under TEST but not under harness ? = still running or test results not (yet) available Build failures during: - = unknown or N/A c = Configure, m = make, M = make (after miniperl), t = m...

Smoke [5.11.0] v5.11.0-219-g26c80ad FAIL(F) netbsd 5.0.1 (i386/1 cpu)
Automated smoke report for 5.11.0 patch 26c80adcc7731c0e4f1238e98e85fa2803538817 v5.11.0-219-g26c80ad p5netbsd: Intel 686-class (i386/1 cpu) on netbsd - 5.0.1 using cc version 4.1.3 20080704 prerelease (NetBSD nb2 20081120) smoketime 6 hours 30 minutes (average 48 minutes 49 seconds) Summary: FAIL(F) O = OK F = Failure(s), extended report at the bottom X = Failure(s) under TEST but not under harness ? = still running or test results not (yet) available Build failures during: - = unknown or N/A c = Configure, m = make, M = make (after miniperl), t = m...

Smoke [5.11.0] v5.11.0-221-g704e1b1 FAIL(F) netbsd 5.0.1 (i386/1 cpu)
Automated smoke report for 5.11.0 patch 704e1b1ec3309aeb0e2629c93331ffd4c18c8183 v5.11.0-221-g704e1b1 p5netbsd: Intel 686-class (i386/1 cpu) on netbsd - 5.0.1 using cc version 4.1.3 20080704 prerelease (NetBSD nb2 20081120) smoketime 6 hours 34 minutes (average 49 minutes 20 seconds) Summary: FAIL(F) O = OK F = Failure(s), extended report at the bottom X = Failure(s) under TEST but not under harness ? = still running or test results not (yet) available Build failures during: - = unknown or N/A c = Configure, m = make, M = make (after miniperl), t = m...

Smoke [5.11.0] v5.11.0-74-g9e7c6af FAIL(F) netbsd 5.0.1 (i386/1 cpu)
Automated smoke report for 5.11.0 patch 9e7c6af37d3320462cbceb74b487ade8224b9191 v5.11.0-74-g9e7c6af p5netbsd: Intel 686-class (i386/1 cpu) on netbsd - 5.0.1 using cc version 4.1.3 20080704 prerelease (NetBSD nb2 20081120) smoketime 8 hours 32 minutes (average 1 hour 4 minutes) Summary: FAIL(F) O = OK F = Failure(s), extended report at the bottom X = Failure(s) under TEST but not under harness ? = still running or test results not (yet) available Build failures during: - = unknown or N/A c = Configure, m = make, M = make (after miniperl), t = make te...

Web resources about - Smoke [5.11.1] v5.11.1-167-g437d421 FAIL(F) netbsd 5.0.1 (i386/1 cpu) - perl.perl5.porters

Suspect???s Ramblings Hint at Motive in Colorado Shooting: Sources
Suspect???s Ramblings Hint at Motive in Colorado Shooting: Sources

Commonwealth seeks legally binding climate deal in Paris
VALLETTA, Malta (AP) — The 53-nation Commonwealth has said climate change poses an "existential threat" to some of its member states, and urged ...

Cyber Monday Is Coming: Are Online Sales Better Than Black Friday?
Move over Black Friday! Cyber Monday is when all the cool kids shop these days. The days of waiting in line outside Best Buy from midnight to ...

Police find newborn girl buried alive near river
RTE.ie Police find newborn girl buried alive near river RTE.ie After a brief search, police discovered a newborn baby girl buried alive under ...

Turkey says pilot's body will be flown back to Russia
CTV News Turkey says pilot's body will be flown back to Russia CTV News ANKARA, Turkey - The Turkish prime minister says Turkey has taken ...

Thousands of Syrian refugee children left in legal limbo
ZAWERGOSK, Iraq (AP) — Aria is stateless. Like thousands of other children born to Syrian refugees living in Iraq, the 10-month-old girl is beginning ...

Premier League team news - ESPN FC
Get all the latest team news and information for the next round of Premier League action.

Egypt says 90% chance of hidden rooms in Tut tomb
The Nation Egypt says 90% chance of hidden rooms in Tut tomb The Nation Egypt's boy king, Tutankhamun, may have extra rooms in his — with ...

Tyson Fury wins unanimous decision over Wladimir Klitschko to become world heavyweight champion
Tyson Fury wrested the world heavyweight title from Wladimir Klitschko in a 12-round unanimous decision in Germany. It was Klitschko's first ...

Pope Francis
BBC News Pope Francis - in conflict zone CAR - seeks 'new chapter' BBC News Pope Francis - visiting his first conflict zone - has said he ...

Resources last updated: 11/29/2015 2:02:07 PM