Smoke [5.11.0] v5.11.0-54-g68cbce5 FAIL(F) netbsd 5.0.1 (i386/1 cpu)

Automated smoke report for 5.11.0 patch 68cbce50efee2c3ae424cfe29c83b65d5b462b69 v5.11.0-54-g68cbce5
p5netbsd: Intel 686-class (i386/1 cpu)
    on        netbsd - 5.0.1
    using     cc version 4.1.3 20080704 prerelease (NetBSD nb2 20081120)
    smoketime 8 hours 24 minutes (average 1 hour 3 minutes)

Summary: FAIL(F)

O = OK  F = Failure(s), extended report at the bottom
X = Failure(s) under TEST but not under harness
? = still running or test results not (yet) available
Build failures during:       - = unknown or N/A
c = Configure, m = make, M = make (after miniperl), t = make test-prep

v5.11.0-54-g68cbce5  Configuration (common) none
----------- ---------------------------------------------------------
F F F F     
F F F F     -Duse64bitint
F F F F     -Duseithreads
F F F F     -Duseithreads -Duse64bitint
| | | +----- PERLIO = perlio -DDEBUGGING
| | +------- PERLIO = stdio  -DDEBUGGING
| +--------- PERLIO = perlio
+----------- PERLIO = stdio


Locally applied patches:
    SMOKE68cbce50efee2c3ae424cfe29c83b65d5b462b69

Failures: (common-args) none
[stdio/perlio] 
[stdio/perlio] -DDEBUGGING
[stdio/perlio] -Duse64bitint
[stdio/perlio] -DDEBUGGING -Duse64bitint
    ../t/re/pat_special_cc.t....................................FAILED
        1, 4, 7

[stdio/perlio] -Duseithreads
[stdio/perlio] -DDEBUGGING -Duseithreads
[stdio/perlio] -Duseithreads -Duse64bitint
[perlio] -DDEBUGGING -Duseithreads -Duse64bitint
    ../t/re/pat_special_cc.t....................................FAILED
        1, 4, 7
    ../t/re/pat_special_cc_thr.t................................FAILED
        1, 4, 7

[stdio] -DDEBUGGING -Duseithreads -Duse64bitint
    ../t/re/pat_special_cc.t....................................FAILED
        1, 4, 7
    ../t/re/pat_special_cc_thr.t................................FAILED
        1, 4, 7
Inconsistent test results (between TEST and harness):
    ../lib/Benchmark.t......................FAILED at test 126

Compiler messages(gcc):
perlio.c: In function 'PerlIOStdio_set_ptrcnt':
perlio.c:3445: warning: pointer targets in assignment differ in signedness
/usr/include/sys/cdefs_elf.h:67:20: error: missing binary operator before token "("
<command line>:1:1: warning: "TIME_HIRES_STAT" redefined
<command line>:1:1: warning: this is the location of the previous definition

-- 
Report by Test::Smoke v1.40 build 1242 running on perl 5.10.0
(Reporter v0.035 / Smoker v0.044)
0
stsc
10/8/2009 6:23:04 AM
perl.perl5.porters 47809 articles. 1 followers. Follow

0 Replies
837 Views

Similar Articles

[PageSpeed] 24

Reply:

Similar Artilces:

Smoke [5.11.0] v5.11.0-177-g63d690b FAIL(F) netbsd 5.0.1 (i386/1 cpu)
Automated smoke report for 5.11.0 patch 63d690b1f5b7e4a4f5cefe645e21a96651cbe9c2 v5.11.0-177-g63d690b p5netbsd: Intel 686-class (i386/1 cpu) on netbsd - 5.0.1 using cc version 4.1.3 20080704 prerelease (NetBSD nb2 20081120) smoketime 6 hours 35 minutes (average 49 minutes 29 seconds) Summary: FAIL(F) O = OK F = Failure(s), extended report at the bottom X = Failure(s) under TEST but not under harness ? = still running or test results not (yet) available Build failures during: - = unknown or N/A c = Configure, m = make, M = make (after miniperl), t = m...

Smoke [5.11.0] v5.11.0-74-g9e7c6af FAIL(F) netbsd 5.0.1 (i386/1 cpu)
Automated smoke report for 5.11.0 patch 9e7c6af37d3320462cbceb74b487ade8224b9191 v5.11.0-74-g9e7c6af p5netbsd: Intel 686-class (i386/1 cpu) on netbsd - 5.0.1 using cc version 4.1.3 20080704 prerelease (NetBSD nb2 20081120) smoketime 8 hours 32 minutes (average 1 hour 4 minutes) Summary: FAIL(F) O = OK F = Failure(s), extended report at the bottom X = Failure(s) under TEST but not under harness ? = still running or test results not (yet) available Build failures during: - = unknown or N/A c = Configure, m = make, M = make (after miniperl), t = make te...

Smoke [5.11.0] v5.11.0-219-g26c80ad FAIL(F) netbsd 5.0.1 (i386/1 cpu)
Automated smoke report for 5.11.0 patch 26c80adcc7731c0e4f1238e98e85fa2803538817 v5.11.0-219-g26c80ad p5netbsd: Intel 686-class (i386/1 cpu) on netbsd - 5.0.1 using cc version 4.1.3 20080704 prerelease (NetBSD nb2 20081120) smoketime 6 hours 30 minutes (average 48 minutes 49 seconds) Summary: FAIL(F) O = OK F = Failure(s), extended report at the bottom X = Failure(s) under TEST but not under harness ? = still running or test results not (yet) available Build failures during: - = unknown or N/A c = Configure, m = make, M = make (after miniperl), t = m...

Smoke [5.11.0] v5.11.0-187-g8dbe7cf FAIL(F) netbsd 5.0.1 (i386/1 cpu)
Automated smoke report for 5.11.0 patch 8dbe7cf704038839ade17963855cf8bfad0c30a3 v5.11.0-187-g8dbe7cf p5netbsd: Intel 686-class (i386/1 cpu) on netbsd - 5.0.1 using cc version 4.1.3 20080704 prerelease (NetBSD nb2 20081120) smoketime 6 hours 35 minutes (average 49 minutes 23 seconds) Summary: FAIL(F) O = OK F = Failure(s), extended report at the bottom X = Failure(s) under TEST but not under harness ? = still running or test results not (yet) available Build failures during: - = unknown or N/A c = Configure, m = make, M = make (after miniperl), t = m...

Smoke [5.11.0] v5.11.0-169-g50e225a FAIL(F) netbsd 5.0.1 (i386/1 cpu)
Automated smoke report for 5.11.0 patch 50e225a377de7c314b13cbaf39b6b423215d84a7 v5.11.0-169-g50e225a p5netbsd: Intel 686-class (i386/1 cpu) on netbsd - 5.0.1 using cc version 4.1.3 20080704 prerelease (NetBSD nb2 20081120) smoketime 6 hours 31 minutes (average 48 minutes 59 seconds) Summary: FAIL(F) O = OK F = Failure(s), extended report at the bottom X = Failure(s) under TEST but not under harness ? = still running or test results not (yet) available Build failures during: - = unknown or N/A c = Configure, m = make, M = make (after miniperl), t = m...

Smoke [5.11.0] v5.11.0-103-g1cce990 FAIL(F) netbsd 5.0.1 (i386/1 cpu)
Automated smoke report for 5.11.0 patch 1cce9906401b8a2db10f2d0061757627ad69f138 v5.11.0-103-g1cce990 p5netbsd: Intel 686-class (i386/1 cpu) on netbsd - 5.0.1 using cc version 4.1.3 20080704 prerelease (NetBSD nb2 20081120) smoketime 8 hours 21 minutes (average 1 hour 2 minutes) Summary: FAIL(F) O = OK F = Failure(s), extended report at the bottom X = Failure(s) under TEST but not under harness ? = still running or test results not (yet) available Build failures during: - = unknown or N/A c = Configure, m = make, M = make (after miniperl), t = make t...

Smoke [5.11.0] v5.11.0-106-g09a3ed3 FAIL(F) netbsd 5.0.1 (i386/1 cpu)
Automated smoke report for 5.11.0 patch 09a3ed31a73051acd8ed0511ea0d927d9660fd22 v5.11.0-106-g09a3ed3 p5netbsd: Intel 686-class (i386/1 cpu) on netbsd - 5.0.1 using cc version 4.1.3 20080704 prerelease (NetBSD nb2 20081120) smoketime 8 hours 30 minutes (average 1 hour 3 minutes) Summary: FAIL(F) O = OK F = Failure(s), extended report at the bottom X = Failure(s) under TEST but not under harness ? = still running or test results not (yet) available Build failures during: - = unknown or N/A c = Configure, m = make, M = make (after miniperl), t = make t...

Smoke [5.11.0] v5.11.0-231-g8f3d599 FAIL(F) netbsd 5.0.1 (i386/1 cpu)
Automated smoke report for 5.11.0 patch 8f3d5996a665cf70e12a836b95e184e9ab628251 v5.11.0-231-g8f3d599 p5netbsd: Intel 686-class (i386/1 cpu) on netbsd - 5.0.1 using cc version 4.1.3 20080704 prerelease (NetBSD nb2 20081120) smoketime 6 hours 31 minutes (average 48 minutes 55 seconds) Summary: FAIL(F) O = OK F = Failure(s), extended report at the bottom X = Failure(s) under TEST but not under harness ? = still running or test results not (yet) available Build failures during: - = unknown or N/A c = Configure, m = make, M = make (after miniperl), t = m...

Smoke [5.11.0] v5.11.0-221-g704e1b1 FAIL(F) netbsd 5.0.1 (i386/1 cpu)
Automated smoke report for 5.11.0 patch 704e1b1ec3309aeb0e2629c93331ffd4c18c8183 v5.11.0-221-g704e1b1 p5netbsd: Intel 686-class (i386/1 cpu) on netbsd - 5.0.1 using cc version 4.1.3 20080704 prerelease (NetBSD nb2 20081120) smoketime 6 hours 34 minutes (average 49 minutes 20 seconds) Summary: FAIL(F) O = OK F = Failure(s), extended report at the bottom X = Failure(s) under TEST but not under harness ? = still running or test results not (yet) available Build failures during: - = unknown or N/A c = Configure, m = make, M = make (after miniperl), t = m...

Smoke [5.11.0] v5.11.0-17-g28e464f FAIL(XF) netbsd 5.0.1 (i386/1 cpu)
Automated smoke report for 5.11.0 patch 28e464fba839d02f376952199261fc8b7d58a0d8 v5.11.0-17-g28e464f p5netbsd: Intel 686-class (i386/1 cpu) on netbsd - 5.0.1 using cc version 4.1.3 20080704 prerelease (NetBSD nb2 20081120) smoketime 7 hours 52 minutes (average 59 minutes 3 seconds) Summary: FAIL(XF) O = OK F = Failure(s), extended report at the bottom X = Failure(s) under TEST but not under harness ? = still running or test results not (yet) available Build failures during: - = unknown or N/A c = Configure, m = make, M = make (after miniperl), t = ma...

Smoke [5.11.0] v5.11.0-261-g8883bb5 FAIL(M) netbsd 5.0.1 (i386/1 cpu)
Automated smoke report for 5.11.0 patch 8883bb5ae00921bf912c003dc007071a4a437baa v5.11.0-261-g8883bb5 p5netbsd: Intel 686-class (i386/1 cpu) on netbsd - 5.0.1 using cc version 4.1.3 20080704 prerelease (NetBSD nb2 20081120) smoketime 16 minutes 4 seconds (average 2 minutes 0.500 seconds) Summary: FAIL(M) O = OK F = Failure(s), extended report at the bottom X = Failure(s) under TEST but not under harness ? = still running or test results not (yet) available Build failures during: - = unknown or N/A c = Configure, m = make, M = make (after miniperl), t...

Smoke [5.11.0] v5.11.0-49-g5b7d14f FAIL(XF) netbsd 5.0.1 (i386/1 cpu)
Automated smoke report for 5.11.0 patch 5b7d14ffe3988c7f70fd9dc76be9c44168d17a62 v5.11.0-49-g5b7d14f p5netbsd: Intel 686-class (i386/1 cpu) on netbsd - 5.0.1 using cc version 4.1.3 20080704 prerelease (NetBSD nb2 20081120) smoketime 8 hours 10 minutes (average 1 hour 1 minute) Summary: FAIL(XF) O = OK F = Failure(s), extended report at the bottom X = Failure(s) under TEST but not under harness ? = still running or test results not (yet) available Build failures during: - = unknown or N/A c = Configure, m = make, M = make (after miniperl), t = make te...

Smoke [5.11.0] v5.11.0-54-g68cbce5 FAIL(F) openbsd 4.5 (i386/1 cpu)
Automated smoke report for 5.11.0 patch 68cbce50efee2c3ae424cfe29c83b65d5b462b69 v5.11.0-54-g68cbce5 p5openbsd: AMD Athlon(tm) Processor ("AuthenticAMD" 686-class, 256KB L2 cache) (909 MHz) (i386/1 cpu) on openbsd - 4.5 using cc version 3.3.5 (propolice) smoketime 12 hours 58 minutes (average 1 hour 37 minutes) Summary: FAIL(F) O = OK F = Failure(s), extended report at the bottom X = Failure(s) under TEST but not under harness ? = still running or test results not (yet) available Build failures during: - = unknown or N/A c = Configure, m = ...

Smoke [5.11.1] v5.11.1-167-g437d421 FAIL(F) netbsd 5.0.1 (i386/1 cpu)
Automated smoke report for 5.11.1 patch 437d4214522421889ca7657c5c9e7dc2f6d1ef7b v5.11.1-167-g437d421 p5netbsd: Intel 686-class (i386/1 cpu) on netbsd - 5.0.1 using cc version 4.1.3 20080704 prerelease (NetBSD nb2 20081120) smoketime 6 hours 43 minutes (average 50 minutes 25 seconds) Summary: FAIL(F) O = OK F = Failure(s), extended report at the bottom X = Failure(s) under TEST but not under harness ? = still running or test results not (yet) available Build failures during: - = unknown or N/A c = Configure, m = make, M = make (after miniperl), t = m...

Web resources about - Smoke [5.11.0] v5.11.0-54-g68cbce5 FAIL(F) netbsd 5.0.1 (i386/1 cpu) - perl.perl5.porters

Liberty University President Jerry Falwell Jr Urges Students To Arm Themselves
At a Liberty University convocation on Friday, university President Rev. Jerry Falwell Jr. encouraged students to arm themselves in response ...

Video shows Miami Beach police shooting man
WMDT Video shows Miami Beach police shooting man WMDT This one occurred Saturday morning when a Miami Beach, Florida, officer killed a man ...

Taking to the hills: tribal groups face up to climate change
Tashka Yawanawa's Amazonian tribe lived on the plains along the Gregorio River for millennia—until a wall of flood water last year forced them ...

Knife attacker slashes man in London 'terrorist incident'
Reuters Knife attacker slashes man in London 'terrorist incident' Reuters LONDON A knife attacker slashed a man at an east London metro station, ...

The Force is strong with this 'Star Wars: Battlefront' PlayStation 4
Darth Vader isn't the friendliest fellow, but his robo-skull visage pairs well with the all-black look of Sony's PlayStation 4. Sony released ...

Gun Violence Erupts in a State of Gun Control
There are two kinds of Americans. One sees a mass shooting such as the recent killings in San Bernardino, California, and Colorado Springs, Colorado ...

PLAYOFF PULSE: Clemson, Alabama, Michigan St join Oklahoma
Albuquerque’s source for local news and live streaming video online. KRQE reports on news, weather, traffic, investigations and sports for New ...

Scott Disick Grabs Lunch With Tyga Before Visiting Kim Kardashian
Scott Disick keeps it casual in a blue hoodie while stepping out to grab lunch with Tyga at Il Pastaio on Saturday afternoon (December 5) in ...

Yemen's Aden governor killed in car bombing claimed by Islamic State
By Mohammed Mukhashaf ADEN (Reuters) - The governor of Aden was killed in a car bomb attack on Sunday claimed by Islamic State in Yemen's southern ...

‘Final Fantasy VII’ Hits PlayStation 4 Today, Remake Far From Original
When Square Enix and Sony announced that Final Fantasy VII will be making a return in the new generation PlayStation 4 console with better and ...

Resources last updated: 12/6/2015 1:30:58 PM