Smoke [5.11.0] v5.11.0-231-g8f3d599 FAIL(F) netbsd 5.0.1 (i386/1 cpu)

Automated smoke report for 5.11.0 patch 8f3d5996a665cf70e12a836b95e184e9ab628251 v5.11.0-231-g8f3d599
p5netbsd: Intel 686-class (i386/1 cpu)
    on        netbsd - 5.0.1
    using     cc version 4.1.3 20080704 prerelease (NetBSD nb2 20081120)
    smoketime 6 hours 31 minutes (average 48 minutes 55 seconds)

Summary: FAIL(F)

O = OK  F = Failure(s), extended report at the bottom
X = Failure(s) under TEST but not under harness
? = still running or test results not (yet) available
Build failures during:       - = unknown or N/A
c = Configure, m = make, M = make (after miniperl), t = make test-prep

v5.11.0-231-g8f3d599  Configuration (common) none
----------- ---------------------------------------------------------
F F F F     
F F F F     -Duse64bitint
F F F F     -Duseithreads
F F F F     -Duseithreads -Duse64bitint
| | | +----- PERLIO = perlio -DDEBUGGING
| | +------- PERLIO = stdio  -DDEBUGGING
| +--------- PERLIO = perlio
+----------- PERLIO = stdio


Locally applied patches:
    SMOKE8f3d5996a665cf70e12a836b95e184e9ab628251

Failures: (common-args) none
[stdio/perlio] 
[stdio/perlio] -DDEBUGGING
[stdio/perlio] -Duse64bitint
[stdio/perlio] -DDEBUGGING -Duse64bitint
    ../t/re/pat_special_cc.t....................................FAILED
        1, 4, 7

[stdio] -Duseithreads
    ../t/re/pat_special_cc.t....................................FAILED
        1, 4, 7
    ../t/re/pat_special_cc_thr.t................................FAILED
        1, 4, 7
Inconsistent test results (between TEST and harness):
    ../lib/Benchmark.t......................FAILED at test 127

[perlio] -Duseithreads
[stdio/perlio] -DDEBUGGING -Duseithreads
[perlio] -Duseithreads -Duse64bitint
[stdio/perlio] -DDEBUGGING -Duseithreads -Duse64bitint
    ../t/re/pat_special_cc.t....................................FAILED
        1, 4, 7
    ../t/re/pat_special_cc_thr.t................................FAILED
        1, 4, 7

[stdio] -Duseithreads -Duse64bitint
    ../t/re/pat_special_cc.t....................................FAILED
        1, 4, 7
    ../t/re/pat_special_cc_thr.t................................FAILED
        1, 4, 7
Inconsistent test results (between TEST and harness):
    ../lib/Benchmark.t......................FAILED at test 126

Compiler messages(gcc):
perlio.c: In function 'PerlIOStdio_set_ptrcnt':
perlio.c:3442: warning: pointer targets in assignment differ in signedness
/usr/include/sys/cdefs_elf.h:67:20: error: missing binary operator before token "("
<command line>:1:1: warning: "TIME_HIRES_STAT" redefined
<command line>:1:1: warning: this is the location of the previous definition

-- 
Report by Test::Smoke v1.40 build 1242 running on perl 5.10.0
(Reporter v0.035 / Smoker v0.044)
0
stsc
10/19/2009 4:25:57 AM
perl.perl5.porters 47814 articles. 1 followers. Follow

0 Replies
802 Views

Similar Articles

[PageSpeed] 37

Reply:

Similar Artilces:

Smoke [5.11.0] v5.11.0-177-g63d690b FAIL(F) netbsd 5.0.1 (i386/1 cpu)
Automated smoke report for 5.11.0 patch 63d690b1f5b7e4a4f5cefe645e21a96651cbe9c2 v5.11.0-177-g63d690b p5netbsd: Intel 686-class (i386/1 cpu) on netbsd - 5.0.1 using cc version 4.1.3 20080704 prerelease (NetBSD nb2 20081120) smoketime 6 hours 35 minutes (average 49 minutes 29 seconds) Summary: FAIL(F) O = OK F = Failure(s), extended report at the bottom X = Failure(s) under TEST but not under harness ? = still running or test results not (yet) available Build failures during: - = unknown or N/A c = Configure, m = make, M = make (after miniperl), t = m...

Smoke [5.11.0] v5.11.0-54-g68cbce5 FAIL(F) netbsd 5.0.1 (i386/1 cpu)
Automated smoke report for 5.11.0 patch 68cbce50efee2c3ae424cfe29c83b65d5b462b69 v5.11.0-54-g68cbce5 p5netbsd: Intel 686-class (i386/1 cpu) on netbsd - 5.0.1 using cc version 4.1.3 20080704 prerelease (NetBSD nb2 20081120) smoketime 8 hours 24 minutes (average 1 hour 3 minutes) Summary: FAIL(F) O = OK F = Failure(s), extended report at the bottom X = Failure(s) under TEST but not under harness ? = still running or test results not (yet) available Build failures during: - = unknown or N/A c = Configure, m = make, M = make (after miniperl), t = make te...

Smoke [5.11.0] v5.11.0-103-g1cce990 FAIL(F) netbsd 5.0.1 (i386/1 cpu)
Automated smoke report for 5.11.0 patch 1cce9906401b8a2db10f2d0061757627ad69f138 v5.11.0-103-g1cce990 p5netbsd: Intel 686-class (i386/1 cpu) on netbsd - 5.0.1 using cc version 4.1.3 20080704 prerelease (NetBSD nb2 20081120) smoketime 8 hours 21 minutes (average 1 hour 2 minutes) Summary: FAIL(F) O = OK F = Failure(s), extended report at the bottom X = Failure(s) under TEST but not under harness ? = still running or test results not (yet) available Build failures during: - = unknown or N/A c = Configure, m = make, M = make (after miniperl), t = make t...

Smoke [5.11.0] v5.11.0-74-g9e7c6af FAIL(F) netbsd 5.0.1 (i386/1 cpu)
Automated smoke report for 5.11.0 patch 9e7c6af37d3320462cbceb74b487ade8224b9191 v5.11.0-74-g9e7c6af p5netbsd: Intel 686-class (i386/1 cpu) on netbsd - 5.0.1 using cc version 4.1.3 20080704 prerelease (NetBSD nb2 20081120) smoketime 8 hours 32 minutes (average 1 hour 4 minutes) Summary: FAIL(F) O = OK F = Failure(s), extended report at the bottom X = Failure(s) under TEST but not under harness ? = still running or test results not (yet) available Build failures during: - = unknown or N/A c = Configure, m = make, M = make (after miniperl), t = make te...

Smoke [5.11.0] v5.11.0-106-g09a3ed3 FAIL(F) netbsd 5.0.1 (i386/1 cpu)
Automated smoke report for 5.11.0 patch 09a3ed31a73051acd8ed0511ea0d927d9660fd22 v5.11.0-106-g09a3ed3 p5netbsd: Intel 686-class (i386/1 cpu) on netbsd - 5.0.1 using cc version 4.1.3 20080704 prerelease (NetBSD nb2 20081120) smoketime 8 hours 30 minutes (average 1 hour 3 minutes) Summary: FAIL(F) O = OK F = Failure(s), extended report at the bottom X = Failure(s) under TEST but not under harness ? = still running or test results not (yet) available Build failures during: - = unknown or N/A c = Configure, m = make, M = make (after miniperl), t = make t...

Smoke [5.11.0] v5.11.0-219-g26c80ad FAIL(F) netbsd 5.0.1 (i386/1 cpu)
Automated smoke report for 5.11.0 patch 26c80adcc7731c0e4f1238e98e85fa2803538817 v5.11.0-219-g26c80ad p5netbsd: Intel 686-class (i386/1 cpu) on netbsd - 5.0.1 using cc version 4.1.3 20080704 prerelease (NetBSD nb2 20081120) smoketime 6 hours 30 minutes (average 48 minutes 49 seconds) Summary: FAIL(F) O = OK F = Failure(s), extended report at the bottom X = Failure(s) under TEST but not under harness ? = still running or test results not (yet) available Build failures during: - = unknown or N/A c = Configure, m = make, M = make (after miniperl), t = m...

Smoke [5.11.0] v5.11.0-221-g704e1b1 FAIL(F) netbsd 5.0.1 (i386/1 cpu)
Automated smoke report for 5.11.0 patch 704e1b1ec3309aeb0e2629c93331ffd4c18c8183 v5.11.0-221-g704e1b1 p5netbsd: Intel 686-class (i386/1 cpu) on netbsd - 5.0.1 using cc version 4.1.3 20080704 prerelease (NetBSD nb2 20081120) smoketime 6 hours 34 minutes (average 49 minutes 20 seconds) Summary: FAIL(F) O = OK F = Failure(s), extended report at the bottom X = Failure(s) under TEST but not under harness ? = still running or test results not (yet) available Build failures during: - = unknown or N/A c = Configure, m = make, M = make (after miniperl), t = m...

Smoke [5.11.0] v5.11.0-169-g50e225a FAIL(F) netbsd 5.0.1 (i386/1 cpu)
Automated smoke report for 5.11.0 patch 50e225a377de7c314b13cbaf39b6b423215d84a7 v5.11.0-169-g50e225a p5netbsd: Intel 686-class (i386/1 cpu) on netbsd - 5.0.1 using cc version 4.1.3 20080704 prerelease (NetBSD nb2 20081120) smoketime 6 hours 31 minutes (average 48 minutes 59 seconds) Summary: FAIL(F) O = OK F = Failure(s), extended report at the bottom X = Failure(s) under TEST but not under harness ? = still running or test results not (yet) available Build failures during: - = unknown or N/A c = Configure, m = make, M = make (after miniperl), t = m...

Smoke [5.11.0] v5.11.0-187-g8dbe7cf FAIL(F) netbsd 5.0.1 (i386/1 cpu)
Automated smoke report for 5.11.0 patch 8dbe7cf704038839ade17963855cf8bfad0c30a3 v5.11.0-187-g8dbe7cf p5netbsd: Intel 686-class (i386/1 cpu) on netbsd - 5.0.1 using cc version 4.1.3 20080704 prerelease (NetBSD nb2 20081120) smoketime 6 hours 35 minutes (average 49 minutes 23 seconds) Summary: FAIL(F) O = OK F = Failure(s), extended report at the bottom X = Failure(s) under TEST but not under harness ? = still running or test results not (yet) available Build failures during: - = unknown or N/A c = Configure, m = make, M = make (after miniperl), t = m...

Smoke [5.11.0] v5.11.0-17-g28e464f FAIL(XF) netbsd 5.0.1 (i386/1 cpu)
Automated smoke report for 5.11.0 patch 28e464fba839d02f376952199261fc8b7d58a0d8 v5.11.0-17-g28e464f p5netbsd: Intel 686-class (i386/1 cpu) on netbsd - 5.0.1 using cc version 4.1.3 20080704 prerelease (NetBSD nb2 20081120) smoketime 7 hours 52 minutes (average 59 minutes 3 seconds) Summary: FAIL(XF) O = OK F = Failure(s), extended report at the bottom X = Failure(s) under TEST but not under harness ? = still running or test results not (yet) available Build failures during: - = unknown or N/A c = Configure, m = make, M = make (after miniperl), t = ma...

Smoke [5.11.0] v5.11.0-49-g5b7d14f FAIL(XF) netbsd 5.0.1 (i386/1 cpu)
Automated smoke report for 5.11.0 patch 5b7d14ffe3988c7f70fd9dc76be9c44168d17a62 v5.11.0-49-g5b7d14f p5netbsd: Intel 686-class (i386/1 cpu) on netbsd - 5.0.1 using cc version 4.1.3 20080704 prerelease (NetBSD nb2 20081120) smoketime 8 hours 10 minutes (average 1 hour 1 minute) Summary: FAIL(XF) O = OK F = Failure(s), extended report at the bottom X = Failure(s) under TEST but not under harness ? = still running or test results not (yet) available Build failures during: - = unknown or N/A c = Configure, m = make, M = make (after miniperl), t = make te...

Smoke [5.11.0] v5.11.0-261-g8883bb5 FAIL(M) netbsd 5.0.1 (i386/1 cpu)
Automated smoke report for 5.11.0 patch 8883bb5ae00921bf912c003dc007071a4a437baa v5.11.0-261-g8883bb5 p5netbsd: Intel 686-class (i386/1 cpu) on netbsd - 5.0.1 using cc version 4.1.3 20080704 prerelease (NetBSD nb2 20081120) smoketime 16 minutes 4 seconds (average 2 minutes 0.500 seconds) Summary: FAIL(M) O = OK F = Failure(s), extended report at the bottom X = Failure(s) under TEST but not under harness ? = still running or test results not (yet) available Build failures during: - = unknown or N/A c = Configure, m = make, M = make (after miniperl), t...

Smoke [5.11.1] v5.11.1-167-g437d421 FAIL(F) netbsd 5.0.1 (i386/1 cpu)
Automated smoke report for 5.11.1 patch 437d4214522421889ca7657c5c9e7dc2f6d1ef7b v5.11.1-167-g437d421 p5netbsd: Intel 686-class (i386/1 cpu) on netbsd - 5.0.1 using cc version 4.1.3 20080704 prerelease (NetBSD nb2 20081120) smoketime 6 hours 43 minutes (average 50 minutes 25 seconds) Summary: FAIL(F) O = OK F = Failure(s), extended report at the bottom X = Failure(s) under TEST but not under harness ? = still running or test results not (yet) available Build failures during: - = unknown or N/A c = Configure, m = make, M = make (after miniperl), t = m...

Smoke [5.11.1] v5.11.1-205-ga1248f1 FAIL(F) netbsd 5.0.1 (i386/1 cpu)
Automated smoke report for 5.11.1 patch a1248f17ffcfa8fe0e91df962317b46b81fc0ce5 v5.11.1-205-ga1248f1 p5netbsd: Intel 686-class (i386/1 cpu) on netbsd - 5.0.1 using cc version 4.1.3 20080704 prerelease (NetBSD nb2 20081120) smoketime 6 hours 36 minutes (average 49 minutes 32 seconds) Summary: FAIL(F) O = OK F = Failure(s), extended report at the bottom X = Failure(s) under TEST but not under harness ? = still running or test results not (yet) available Build failures during: - = unknown or N/A c = Configure, m = make, M = make (after miniperl), t = m...

Web resources about - Smoke [5.11.0] v5.11.0-231-g8f3d599 FAIL(F) netbsd 5.0.1 (i386/1 cpu) - perl.perl5.porters

Watch Disrupt London Day One LIVE Right Here!
Disrupt London 2015 is now officially underway, after an incredibly successful Hackathon where FreeMe took home the main prize. Today, the conference ...

Doctors: Latest brain scan is good news for Jimmy Carter
ATLANTA (AP) — A recent MRI showing no cancer on Jimmy Carter's brain is "very positive" news for the former president but will not end his medical ...

France’s far-right National Front tops first round of regional vote
France’s far-right National Front (FN) party rode a wave of fear over immigration and terrorism to storm to a commanding position in the first ...

Laquan McDonald Shooting: Chicago Police Reports Offer Different Account From ...
Washington Post Laquan McDonald Shooting: Chicago Police Reports Offer Different Account From ... KTLA Chicago police reports on the fatal ...

What Would An Eight-Team College Football Playoff Have Looked Like In 2015?
College football fans are ready for an eight-team playoff. Just hours after the committee selected this year’s college football playoff teams, ...

As Silicon Valley Bank surges on loans to tech startups, its exposure to risky loans also rises
Wall Street Journal : As Silicon Valley Bank surges on loans to tech startups, its exposure to risky loans also rises — Silicon Valley's Hometown ...

SNL reveals the true aftermath of an alien abduction
Technically Incorrect: After the little green people have let you go, you have to reveal all to the NSA. That's not so easy.

‘Crippled America’ Shines Spotlight On Donald Trump’s Other Career
The Iowa Caucuses are less than 60 days away, and much to the chagrin of some, Donald Trump has maintained a comfortable lead on his competitors. ...

Go behind the scenes of the U.N. Climate Summit with 'Earth to Paris'
Now is the time to act. More than 40,000 diplomats, experts and advocates, including more than 135 world leaders, are currently in Paris to ...

Jerry Falwell Urges Liberty University Students To Arm Themselves And ‘End Those Muslims’
Liberty University President Jerry Falwell, Jr. urged students to arm themselves by getting their permits to carry concealed weapons while speaking ...

Resources last updated: 12/7/2015 9:27:16 AM