Smoke [5.10.0] maint-5.10-306-gf399cac FAIL(XF) netbsd 4.0.1 (i386/1 cpu)

Automated smoke report for 5.10.0 patch f399cac1256d7e7d3864805b5c7b39e71cf4ccb8 maint-5.10-306-gf399cac
p5netbsd: AMD Duron (686-class) (i386/1 cpu)
    on        netbsd - 4.0.1
    using     cc version 4.1.2 20061021 prerelease (NetBSD nb3 20061125)
    smoketime 21 hours 46 minutes (average 2 hours 43 minutes)

Summary: FAIL(XF)

O = OK  F = Failure(s), extended report at the bottom
X = Failure(s) under TEST but not under harness
? = still running or test results not (yet) available
Build failures during:       - = unknown or N/A
c = Configure, m = make, M = make (after miniperl), t = make test-prep

maint-5.10-306-gf399cac  Configuration (common) none
----------- ---------------------------------------------------------
O O O O     
O O O O     -Duse64bitint
O O O X     -Duseithreads
O O F X     -Duseithreads -Duse64bitint
| | | +----- PERLIO = perlio -DDEBUGGING
| | +------- PERLIO = stdio  -DDEBUGGING
| +--------- PERLIO = perlio
+----------- PERLIO = stdio


Locally applied patches:
    MAINT35117
    SMOKEf399cac1256d7e7d3864805b5c7b39e71cf4ccb8

Failures: (common-args) none
[perlio] -DDEBUGGING -Duseithreads
Inconsistent test results (between TEST and harness):
    ../ext/threads/shared/t/waithires.t.....FAILED at test 17

[stdio] -DDEBUGGING -Duseithreads -Duse64bitint
    ../ext/threads/shared/t/waithires.t.........................FAILED
        7, 40, 45

[perlio] -DDEBUGGING -Duseithreads -Duse64bitint
Inconsistent test results (between TEST and harness):
    ../ext/threads/shared/t/waithires.t.....FAILED at test 35

Compiler messages(gcc):
perlio.c: In function 'PerlIOStdio_set_ptrcnt':
perlio.c:3442: warning: pointer targets in assignment differ in signedness
Peek.c: In function 'XS_Devel__Peek_mstat':
Peek.c:353: warning: passing argument 1 of 'Perl_dump_mstats' discards qualifiers from pointer target type
<command line>:1:1: warning: "TIME_HIRES_STAT" redefined
<command line>:1:1: warning: this is the location of the previous definition
/usr/include/sys/cdefs_elf.h:67:20: error: missing binary operator before token "("
Peek.c:353: warning: passing argument 2 of 'Perl_dump_mstats' discards qualifiers from pointer target type

-- 
Report by Test::Smoke v1.39 build 1235 running on perl 5.8.8
(Reporter v0.035 / Smoker v0.044)
0
stsc
3/13/2009 8:46:56 AM
perl.perl5.porters 47803 articles. 1 followers. Follow

0 Replies
535 Views

Similar Articles

[PageSpeed] 14

Reply:

Similar Artilces:

Smoke [5.10.0] maint-5.10-957-g803123f FAIL(XF) netbsd 4.0.1 (i386/1 cpu)
Automated smoke report for 5.10.0 patch 803123f0d669db74e93858d329fb2e7a6de1ef40 maint-5.10-957-g803123f p5netbsd: AMD Duron (686-class) (i386/1 cpu) on netbsd - 4.0.1 using cc version 4.1.2 20061021 prerelease (NetBSD nb3 20061125) smoketime 1 day 27 minutes (average 3 hours 3 minutes) Summary: FAIL(XF) O = OK F = Failure(s), extended report at the bottom X = Failure(s) under TEST but not under harness ? = still running or test results not (yet) available Build failures during: - = unknown or N/A c = Configure, m = make, M = make (after miniperl), t...

Smoke [5.10.0] maint-5.10-1021-gc83257b FAIL(XF) netbsd 4.0.1 (i386/1 cpu)
Automated smoke report for 5.10.0 patch c83257bcd8d9878d888f0d1f86aa90088946c906 maint-5.10-1021-gc83257b p5netbsd: AMD Duron (686-class) (i386/1 cpu) on netbsd - 4.0.1 using cc version 4.1.2 20061021 prerelease (NetBSD nb3 20061125) smoketime 1 day 31 minutes (average 3 hours 3 minutes) Summary: FAIL(XF) O = OK F = Failure(s), extended report at the bottom X = Failure(s) under TEST but not under harness ? = still running or test results not (yet) available Build failures during: - = unknown or N/A c = Configure, m = make, M = make (after miniperl), ...

Smoke [5.10.0] maint-5.10-302-g9408c95 FAIL(XF) netbsd 4.0.1 (i386/1 cpu)
Automated smoke report for 5.10.0 patch 9408c95930c8a02f5895231b594438301b347ade maint-5.10-302-g9408c95 p5netbsd: AMD Duron (686-class) (i386/1 cpu) on netbsd - 4.0.1 using cc version 4.1.2 20061021 prerelease (NetBSD nb3 20061125) smoketime 21 hours 47 minutes (average 2 hours 43 minutes) Summary: FAIL(XF) O = OK F = Failure(s), extended report at the bottom X = Failure(s) under TEST but not under harness ? = still running or test results not (yet) available Build failures during: - = unknown or N/A c = Configure, m = make, M = make (after miniperl...

Smoke [5.10.0] maint-5.10-333-g9d20908 FAIL(XF) netbsd 4.0.1 (i386/1 cpu)
Automated smoke report for 5.10.0 patch 9d20908063546f3b632075bec44205d1b6f709b0 maint-5.10-333-g9d20908 p5netbsd: AMD Duron (686-class) (i386/1 cpu) on netbsd - 4.0.1 using cc version 4.1.2 20061021 prerelease (NetBSD nb3 20061125) smoketime 16 hours 20 minutes (average 2 hours 2 minutes) Summary: FAIL(XF) O = OK F = Failure(s), extended report at the bottom X = Failure(s) under TEST but not under harness ? = still running or test results not (yet) available Build failures during: - = unknown or N/A c = Configure, m = make, M = make (after miniperl)...

Smoke [5.10.0] maint-5.10-188-g6c1c150 FAIL(m) netbsd 4.0.1 (i386/1 cpu)
Automated smoke report for 5.10.0 patch 6c1c150b4ab959ad1fb1f7862dfb1a1caed12071 maint-5.10-188-g6c1c150 p5netbsd: AMD Duron (686-class) (i386/1 cpu) on netbsd - 4.0.1 using cc version 4.1.2 20061021 prerelease (NetBSD nb3 20061125) smoketime 19 minutes 25 seconds (average 2 minutes 25.625 seconds) Summary: FAIL(m) O = OK F = Failure(s), extended report at the bottom X = Failure(s) under TEST but not under harness ? = still running or test results not (yet) available Build failures during: - = unknown or N/A c = Configure, m = make, M = make (after m...

Smoke [5.10.0] maint-5.10-186-g8f089f6 FAIL(m) netbsd 4.0.1 (i386/1 cpu)
Automated smoke report for 5.10.0 patch 8f089f6646fb9d8cf7c65d7a9d8a2273000bd9d6 maint-5.10-186-g8f089f6 p5netbsd: AMD Duron (686-class) (i386/1 cpu) on netbsd - 4.0.1 using cc version 4.1.2 20061021 prerelease (NetBSD nb3 20061125) smoketime 19 minutes 18 seconds (average 2 minutes 24.750 seconds) Summary: FAIL(m) O = OK F = Failure(s), extended report at the bottom X = Failure(s) under TEST but not under harness ? = still running or test results not (yet) available Build failures during: - = unknown or N/A c = Configure, m = make, M = make (after m...

Smoke [5.10.0] maint-5.10-381-g136f962 FAIL(F) netbsd 4.0.1 (i386/1 cpu)
Automated smoke report for 5.10.0 patch 136f96283a398f49aa36b7d47086bf37fd04c4b4 maint-5.10-381-g136f962 p5netbsd: AMD Duron (686-class) (i386/1 cpu) on netbsd - 4.0.1 using cc version 4.1.2 20061021 prerelease (NetBSD nb3 20061125) smoketime 22 hours 37 minutes (average 2 hours 49 minutes) Summary: FAIL(F) O = OK F = Failure(s), extended report at the bottom X = Failure(s) under TEST but not under harness ? = still running or test results not (yet) available Build failures during: - = unknown or N/A c = Configure, m = make, M = make (after miniperl)...

Smoke [5.10.0] maint-5.10-1079-ga9d5891 FAIL(F) netbsd 4.0.1 (i386/1 cpu)
Automated smoke report for 5.10.0 patch a9d58912b709187ad8c9e439b72b3a14130d36d8 maint-5.10-1079-ga9d5891 p5netbsd: AMD Duron (686-class) (i386/1 cpu) on netbsd - 4.0.1 using cc version 4.1.2 20061021 prerelease (NetBSD nb3 20061125) smoketime 18 hours 22 minutes (average 2 hours 17 minutes) Summary: FAIL(F) O = OK F = Failure(s), extended report at the bottom X = Failure(s) under TEST but not under harness ? = still running or test results not (yet) available Build failures during: - = unknown or N/A c = Configure, m = make, M = make (after miniperl...

Smoke [5.10.0] maint-5.10-346-gb941d8b FAIL(F) netbsd 4.0.1 (i386/1 cpu)
Automated smoke report for 5.10.0 patch b941d8bbf1cec8924975fbd33e853485c15eb066 maint-5.10-346-gb941d8b p5netbsd: AMD Duron (686-class) (i386/1 cpu) on netbsd - 4.0.1 using cc version 4.1.2 20061021 prerelease (NetBSD nb3 20061125) smoketime 22 hours 40 minutes (average 2 hours 50 minutes) Summary: FAIL(F) O = OK F = Failure(s), extended report at the bottom X = Failure(s) under TEST but not under harness ? = still running or test results not (yet) available Build failures during: - = unknown or N/A c = Configure, m = make, M = make (after miniperl)...

Smoke [5.10.0] maint-5.10-459-g6a49472 FAIL(F) netbsd 4.0.1 (i386/1 cpu)
Automated smoke report for 5.10.0 patch 6a4947285303421b2ef88204489fbfd215e26389 maint-5.10-459-g6a49472 p5netbsd: AMD Duron (686-class) (i386/1 cpu) on netbsd - 4.0.1 using cc version 4.1.2 20061021 prerelease (NetBSD nb3 20061125) smoketime 21 hours 53 minutes (average 2 hours 44 minutes) Summary: FAIL(F) O = OK F = Failure(s), extended report at the bottom X = Failure(s) under TEST but not under harness ? = still running or test results not (yet) available Build failures during: - = unknown or N/A c = Configure, m = make, M = make (after miniperl)...

Smoke [5.10.0] maint-5.10-328-gbcd41b7 FAIL(F) netbsd 4.0.1 (i386/1 cpu)
Automated smoke report for 5.10.0 patch bcd41b7997abaa21e066e80f23cd72857f8f5f56 maint-5.10-328-gbcd41b7 p5netbsd: AMD Duron (686-class) (i386/1 cpu) on netbsd - 4.0.1 using cc version 4.1.2 20061021 prerelease (NetBSD nb3 20061125) smoketime 14 hours 12 minutes (average 1 hour 46 minutes) Summary: FAIL(F) O = OK F = Failure(s), extended report at the bottom X = Failure(s) under TEST but not under harness ? = still running or test results not (yet) available Build failures during: - = unknown or N/A c = Configure, m = make, M = make (after miniperl),...

Smoke [5.10.0] maint-5.10-299-g1625989 FAIL(F) netbsd 4.0.1 (i386/1 cpu)
Automated smoke report for 5.10.0 patch 16259899a80a8de3fd74bd26a6308681f03dac63 maint-5.10-299-g1625989 p5netbsd: AMD Duron (686-class) (i386/1 cpu) on netbsd - 4.0.1 using cc version 4.1.2 20061021 prerelease (NetBSD nb3 20061125) smoketime 21 hours 43 minutes (average 2 hours 42 minutes) Summary: FAIL(F) O = OK F = Failure(s), extended report at the bottom X = Failure(s) under TEST but not under harness ? = still running or test results not (yet) available Build failures during: - = unknown or N/A c = Configure, m = make, M = make (after miniperl)...

Smoke [5.10.0] maint-5.10-598-g331b76d FAIL(F) netbsd 4.0.1 (i386/1 cpu)
Automated smoke report for 5.10.0 patch 331b76decc59416d8320ad49a4fba9fed874a177 maint-5.10-598-g331b76d p5netbsd: AMD Duron (686-class) (i386/1 cpu) on netbsd - 4.0.1 using cc version 4.1.2 20061021 prerelease (NetBSD nb3 20061125) smoketime 16 hours 44 minutes (average 2 hours 5 minutes) Summary: FAIL(F) O = OK F = Failure(s), extended report at the bottom X = Failure(s) under TEST but not under harness ? = still running or test results not (yet) available Build failures during: - = unknown or N/A c = Configure, m = make, M = make (after miniperl),...

Smoke [5.10.0] maint-5.10-1171-ga2d4e51 FAIL(XF) netbsd 5.0 (i386/1 cpu)
Automated smoke report for 5.10.0 patch a2d4e51092c9dc1403a07e3cc313045aa0fabe63 maint-5.10-1171-ga2d4e51 p5netbsd: Intel 686-class (i386/1 cpu) on netbsd - 5.0 using cc version 4.1.3 20080704 prerelease (NetBSD nb2 20081120) smoketime 5 hours 13 minutes (average 39 minutes 10 seconds) Summary: FAIL(XF) O = OK F = Failure(s), extended report at the bottom X = Failure(s) under TEST but not under harness ? = still running or test results not (yet) available Build failures during: - = unknown or N/A c = Configure, m = make, M = make (after miniperl), t ...

Web resources about - Smoke [5.10.0] maint-5.10-306-gf399cac FAIL(XF) netbsd 4.0.1 (i386/1 cpu) - perl.perl5.porters

Resources last updated: 12/20/2015 5:06:10 AM