Smoke [5.10.0] maint-5.10-1171-ga2d4e51 FAIL(XF) netbsd 5.0 (i386/1 cpu)

Automated smoke report for 5.10.0 patch a2d4e51092c9dc1403a07e3cc313045aa0fabe63 maint-5.10-1171-ga2d4e51
p5netbsd: Intel 686-class (i386/1 cpu)
    on        netbsd - 5.0
    using     cc version 4.1.3 20080704 prerelease (NetBSD nb2 20081120)
    smoketime 5 hours 13 minutes (average 39 minutes 10 seconds)

Summary: FAIL(XF)

O = OK  F = Failure(s), extended report at the bottom
X = Failure(s) under TEST but not under harness
? = still running or test results not (yet) available
Build failures during:       - = unknown or N/A
c = Configure, m = make, M = make (after miniperl), t = make test-prep

maint-5.10-1171-ga2d4e51  Configuration (common) none
----------- ---------------------------------------------------------
O X O X     
O O F X     -Duse64bitint
O X X O     -Duseithreads
O O O O     -Duseithreads -Duse64bitint
| | | +----- PERLIO = perlio -DDEBUGGING
| | +------- PERLIO = stdio  -DDEBUGGING
| +--------- PERLIO = perlio
+----------- PERLIO = stdio


Locally applied patches:
    SMOKEa2d4e51092c9dc1403a07e3cc313045aa0fabe63

Failures: (common-args) none
[perlio] 
[perlio] -DDEBUGGING
[perlio] -DDEBUGGING -Duse64bitint
[perlio] -Duseithreads
[stdio] -DDEBUGGING -Duseithreads
Inconsistent test results (between TEST and harness):
    ../lib/Benchmark.t......................FAILED at test 126

[stdio] -DDEBUGGING -Duse64bitint
    ../lib/Benchmark.t..........................................FAILED
        126-127

Compiler messages(gcc):
perlio.c: In function 'PerlIOStdio_set_ptrcnt':
perlio.c:3450: warning: pointer targets in assignment differ in signedness
Peek.c: In function 'XS_Devel__Peek_mstat':
Peek.c:353: warning: passing argument 1 of 'Perl_dump_mstats' discards qualifiers from pointer target type
<command line>:1:1: warning: "TIME_HIRES_STAT" redefined
<command line>:1:1: warning: this is the location of the previous definition
/usr/include/sys/cdefs_elf.h:67:20: error: missing binary operator before token "("
Peek.c:353: warning: passing argument 2 of 'Perl_dump_mstats' discards qualifiers from pointer target type

-- 
Report by Test::Smoke v1.39 build 1235 running on perl 5.10.0
(Reporter v0.035 / Smoker v0.044)
0
stsc
5/18/2009 3:10:49 PM
perl.perl5.porters 47791 articles. 1 followers. Follow

0 Replies
554 Views

Similar Articles

[PageSpeed] 7

Reply:

Similar Artilces:

Smoke [5.10.0] maint-5.10-1220-gd0f0947 FAIL(XF) netbsd 5.0 (i386/1 cpu)
Automated smoke report for 5.10.0 patch d0f09470a55cd54ec20843bfdb3ba974a83bd6bb maint-5.10-1220-gd0f0947 p5netbsd: Intel 686-class (i386/1 cpu) on netbsd - 5.0 using cc version 4.1.3 20080704 prerelease (NetBSD nb2 20081120) smoketime 5 hours 15 minutes (average 39 minutes 25 seconds) Summary: FAIL(XF) O = OK F = Failure(s), extended report at the bottom X = Failure(s) under TEST but not under harness ? = still running or test results not (yet) available Build failures during: - = unknown or N/A c = Configure, m = make, M = make (after miniperl), t ...

Smoke [5.10.0] maint-5.10-1141-g2700d9b FAIL(XF) netbsd 5.0 (i386/1 cpu)
Automated smoke report for 5.10.0 patch 2700d9b0bf253b12ed6a4ccf931fa4705edf2315 maint-5.10-1141-g2700d9b p5netbsd: AMD 686-class (i386/1 cpu) on netbsd - 5.0 using cc version 4.1.3 20080704 prerelease (NetBSD nb2 20081120) smoketime 22 hours 1 minute (average 2 hours 45 minutes) Summary: FAIL(XF) O = OK F = Failure(s), extended report at the bottom X = Failure(s) under TEST but not under harness ? = still running or test results not (yet) available Build failures during: - = unknown or N/A c = Configure, m = make, M = make (after miniperl), t = make...

Smoke [5.10.0] maint-5.10-1169-ga0ab88b FAIL(XF) netbsd 5.0 (i386/1 cpu)
Automated smoke report for 5.10.0 patch a0ab88bb2bd59be4e0b0733f8f9f8557e373aed1 maint-5.10-1169-ga0ab88b p5netbsd: Intel 686-class (i386/1 cpu) on netbsd - 5.0 using cc version 4.1.3 20080704 prerelease (NetBSD nb2 20081120) smoketime 5 hours 11 minutes (average 38 minutes 58 seconds) Summary: FAIL(XF) O = OK F = Failure(s), extended report at the bottom X = Failure(s) under TEST but not under harness ? = still running or test results not (yet) available Build failures during: - = unknown or N/A c = Configure, m = make, M = make (after miniperl), t ...

Smoke [5.10.0] maint-5.10-1462-g178839f FAIL(XF) netbsd 5.0 (i386/1 cpu)
Automated smoke report for 5.10.0 patch 178839f6222a37fcd169f62b4380083881cc6083 maint-5.10-1462-g178839f p5netbsd: Intel 686-class (i386/1 cpu) on netbsd - 5.0 using cc version 4.1.3 20080704 prerelease (NetBSD nb2 20081120) smoketime 5 hours 13 minutes (average 39 minutes 10 seconds) Summary: FAIL(XF) O = OK F = Failure(s), extended report at the bottom X = Failure(s) under TEST but not under harness ? = still running or test results not (yet) available Build failures during: - = unknown or N/A c = Configure, m = make, M = make (after miniperl), t ...

Smoke [5.10.0] maint-5.10-1156-g45957f2 FAIL(XF) netbsd 5.0 (i386/1 cpu)
Automated smoke report for 5.10.0 patch 45957f2ee9816a6647753f1d918f837b83e9bf04 maint-5.10-1156-g45957f2 p5netbsd.refcnt.homeunix.org: Intel 686-class (i386/1 cpu) on netbsd - 5.0 using cc version 4.1.3 20080704 prerelease (NetBSD nb2 20081120) smoketime 5 hours 12 minutes (average 39 minutes 5 seconds) Summary: FAIL(XF) O = OK F = Failure(s), extended report at the bottom X = Failure(s) under TEST but not under harness ? = still running or test results not (yet) available Build failures during: - = unknown or N/A c = Configure, m = make, M = make (...

Smoke [5.10.0] maint-5.10-1196-ga8a43ff FAIL(XF) netbsd 5.0 (i386/1 cpu)
Automated smoke report for 5.10.0 patch a8a43ff0f2638c954fe34867dadcb2d38093888d maint-5.10-1196-ga8a43ff p5netbsd: Intel 686-class (i386/1 cpu) on netbsd - 5.0 using cc version 4.1.3 20080704 prerelease (NetBSD nb2 20081120) smoketime 5 hours 12 minutes (average 39 minutes 5 seconds) Summary: FAIL(XF) O = OK F = Failure(s), extended report at the bottom X = Failure(s) under TEST but not under harness ? = still running or test results not (yet) available Build failures during: - = unknown or N/A c = Configure, m = make, M = make (after miniperl), t =...

Smoke [5.10.1] maint-5.10-1725-g5b53e9f FAIL(XF) netbsd 5.0 (i386/1 cpu)
Automated smoke report for 5.10.1 patch 5b53e9f3c366c11df59536b294aba43e843db9b0 maint-5.10-1725-g5b53e9f p5netbsd: Intel 686-class (i386/1 cpu) on netbsd - 5.0 using cc version 4.1.3 20080704 prerelease (NetBSD nb2 20081120) smoketime 8 hours 17 minutes (average 1 hour 2 minutes) Summary: FAIL(XF) O = OK F = Failure(s), extended report at the bottom X = Failure(s) under TEST but not under harness ? = still running or test results not (yet) available Build failures during: - = unknown or N/A c = Configure, m = make, M = make (after miniperl), t = mak...

Smoke [5.10.0] maint-5.10-302-g9408c95 FAIL(XF) netbsd 4.0.1 (i386/1 cpu)
Automated smoke report for 5.10.0 patch 9408c95930c8a02f5895231b594438301b347ade maint-5.10-302-g9408c95 p5netbsd: AMD Duron (686-class) (i386/1 cpu) on netbsd - 4.0.1 using cc version 4.1.2 20061021 prerelease (NetBSD nb3 20061125) smoketime 21 hours 47 minutes (average 2 hours 43 minutes) Summary: FAIL(XF) O = OK F = Failure(s), extended report at the bottom X = Failure(s) under TEST but not under harness ? = still running or test results not (yet) available Build failures during: - = unknown or N/A c = Configure, m = make, M = make (after miniperl...

Smoke [5.10.0] maint-5.10-1021-gc83257b FAIL(XF) netbsd 4.0.1 (i386/1 cpu)
Automated smoke report for 5.10.0 patch c83257bcd8d9878d888f0d1f86aa90088946c906 maint-5.10-1021-gc83257b p5netbsd: AMD Duron (686-class) (i386/1 cpu) on netbsd - 4.0.1 using cc version 4.1.2 20061021 prerelease (NetBSD nb3 20061125) smoketime 1 day 31 minutes (average 3 hours 3 minutes) Summary: FAIL(XF) O = OK F = Failure(s), extended report at the bottom X = Failure(s) under TEST but not under harness ? = still running or test results not (yet) available Build failures during: - = unknown or N/A c = Configure, m = make, M = make (after miniperl), ...

Smoke [5.10.0] maint-5.10-957-g803123f FAIL(XF) netbsd 4.0.1 (i386/1 cpu)
Automated smoke report for 5.10.0 patch 803123f0d669db74e93858d329fb2e7a6de1ef40 maint-5.10-957-g803123f p5netbsd: AMD Duron (686-class) (i386/1 cpu) on netbsd - 4.0.1 using cc version 4.1.2 20061021 prerelease (NetBSD nb3 20061125) smoketime 1 day 27 minutes (average 3 hours 3 minutes) Summary: FAIL(XF) O = OK F = Failure(s), extended report at the bottom X = Failure(s) under TEST but not under harness ? = still running or test results not (yet) available Build failures during: - = unknown or N/A c = Configure, m = make, M = make (after miniperl), t...

Smoke [5.10.0] maint-5.10-306-gf399cac FAIL(XF) netbsd 4.0.1 (i386/1 cpu)
Automated smoke report for 5.10.0 patch f399cac1256d7e7d3864805b5c7b39e71cf4ccb8 maint-5.10-306-gf399cac p5netbsd: AMD Duron (686-class) (i386/1 cpu) on netbsd - 4.0.1 using cc version 4.1.2 20061021 prerelease (NetBSD nb3 20061125) smoketime 21 hours 46 minutes (average 2 hours 43 minutes) Summary: FAIL(XF) O = OK F = Failure(s), extended report at the bottom X = Failure(s) under TEST but not under harness ? = still running or test results not (yet) available Build failures during: - = unknown or N/A c = Configure, m = make, M = make (after miniperl...

Smoke [5.10.0] maint-5.10-333-g9d20908 FAIL(XF) netbsd 4.0.1 (i386/1 cpu)
Automated smoke report for 5.10.0 patch 9d20908063546f3b632075bec44205d1b6f709b0 maint-5.10-333-g9d20908 p5netbsd: AMD Duron (686-class) (i386/1 cpu) on netbsd - 4.0.1 using cc version 4.1.2 20061021 prerelease (NetBSD nb3 20061125) smoketime 16 hours 20 minutes (average 2 hours 2 minutes) Summary: FAIL(XF) O = OK F = Failure(s), extended report at the bottom X = Failure(s) under TEST but not under harness ? = still running or test results not (yet) available Build failures during: - = unknown or N/A c = Configure, m = make, M = make (after miniperl)...

Smoke [5.10.0] maint-5.10-1334-gb78898b FAIL(M) netbsd 5.0 (i386/1 cpu)
Automated smoke report for 5.10.0 patch b78898b8dbfe9f00fd16a8e70459e0d92ba1b9fd maint-5.10-1334-gb78898b p5netbsd: Intel 686-class (i386/1 cpu) on netbsd - 5.0 using cc version 4.1.3 20080704 prerelease (NetBSD nb2 20081120) smoketime 15 minutes 50 seconds (average 1 minute 58.750 seconds) Summary: FAIL(M) O = OK F = Failure(s), extended report at the bottom X = Failure(s) under TEST but not under harness ? = still running or test results not (yet) available Build failures during: - = unknown or N/A c = Configure, m = make, M = make (after miniperl)...

Smoke [5.10.0] maint-5.10-1338-ga725c5e FAIL(M) netbsd 5.0 (i386/1 cpu)
Automated smoke report for 5.10.0 patch a725c5ec96926d5d481dff0fa79534be2769e27e maint-5.10-1338-ga725c5e p5netbsd: Intel 686-class (i386/1 cpu) on netbsd - 5.0 using cc version 4.1.3 20080704 prerelease (NetBSD nb2 20081120) smoketime 15 minutes 52 seconds (average 1 minute 59 seconds) Summary: FAIL(M) O = OK F = Failure(s), extended report at the bottom X = Failure(s) under TEST but not under harness ? = still running or test results not (yet) available Build failures during: - = unknown or N/A c = Configure, m = make, M = make (after miniperl), t ...

Web resources about - Smoke [5.10.0] maint-5.10-1171-ga2d4e51 FAIL(XF) netbsd 5.0 (i386/1 cpu) - perl.perl5.porters

Resources last updated: 11/29/2015 10:49:28 AM