RE: Smoke [5.9.5] 29501 FAIL(F) HP-UX B.11.11/64 (PA-RISC2.0/2 cpu)

From
http://beta.nntp.perl.org/group/perl.daily-build.reports/2006/12/msg43142.html
:

[stdio] -DDEBUGGING -Duseithreads
    ../ext/threads/t/libc.t.................FAILED 9-10 12

[perlio] -DDEBUGGING -Duseithreads
    ../ext/threads/t/libc.t.................FAILED 5-6 9 11-12

[univ.utf8] -DDEBUGGING -Duseithreads
    ../ext/threads/t/libc.t.................FAILED 4-8 10-11

This shows that 'localtime' is not thread-safe under this HP-UX build.
Anyone have a clue as to why and/or how to fix it?


 
____________________________________________________________________________________
Do you Yahoo!?
Everyone is raving about the all-new Yahoo! Mail beta.
http://new.mail.yahoo.com
0
jdhedden
12/12/2006 2:30:19 PM
perl.perl5.porters 47902 articles. 1 followers. Follow

2 Replies
697 Views

Similar Articles

[PageSpeed] 1

On Tue, 12 Dec 2006 06:30:19 -0800 (PST), "Jerry D. Hedden"
<jdhedden@yahoo.com> wrote:

> From
> http://beta.nntp.perl.org/group/perl.daily-build.reports/2006/12/msg43142.html
> :
> 
> [stdio] -DDEBUGGING -Duseithreads
>     ../ext/threads/t/libc.t.................FAILED 9-10 12
> 
> [perlio] -DDEBUGGING -Duseithreads
>     ../ext/threads/t/libc.t.................FAILED 5-6 9 11-12
> 
> [univ.utf8] -DDEBUGGING -Duseithreads
>     ../ext/threads/t/libc.t.................FAILED 4-8 10-11
> 
> This shows that 'localtime' is not thread-safe under this HP-UX build.
> Anyone have a clue as to why and/or how to fix it?

That's my system. I have no idea where to look.
It's a strange failing pattern.

Guide me to the exact things you want to know ...

-- 
H.Merijn Brand         Amsterdam Perl Mongers (http://amsterdam.pm.org/)
using & porting perl 5.6.2, 5.8.x, 5.9.x   on HP-UX 10.20, 11.00, 11.11,
& 11.23, SuSE 10.0 & 10.1, AIX 4.3 & 5.2, and Cygwin. http://qa.perl.org
http://mirrors.develooper.com/hpux/            http://www.test-smoke.org
                        http://www.goldmark.org/jeff/stupid-disclaimers/
0
h
12/12/2006 2:34:12 PM
On 12/12/06, Jerry D. Hedden <jdhedden@yahoo.com> wrote:
> This shows that 'localtime' is not thread-safe under this HP-UX build.
> Anyone have a clue as to why and/or how to fix it?

Has this HP-UX box localtime_r, and if so, should it be added in the
hints file so it is properly used?
0
rgarciasuarez
12/12/2006 2:35:23 PM
Reply:

Similar Artilces:

Fw: Smoke [5.11.0] 33789 FAIL(F) HP-UX B.11.11/64 (PA-RISC2.0/64/2 cpu)
Below report is still failing in current blead. My analysis was either ignored or missed or not received. Begin forwarded message: Date: Thu, 8 May 2008 13:06:24 +0200 From: "H.Merijn Brand" <h.m.brand@xs4all.nl> To: "H.Merijn Brand" <h.m.brand@xs4all.nl> Cc: smokers-reports@perl.org Subject: Re: Smoke [5.11.0] 33789 FAIL(F) HP-UX B.11.11/64 (PA-RISC2.0/64/2 cpu) On Thu, 8 May 2008 08:26 +0200, "H.Merijn Brand" <h.m.brand@xs4all.nl> wrote: > Automated smoke report for 5.11.0 patch 33789 > r3: PA8800 (PA-RISC2.0/64/2 cpu) ...

Fw: Smoke [5.10.0] 32093 FAIL(F) HP-UX B.11.00/64 (PA-RISC2.0/64/2 cpu)
### You may have to set your dynamic library search path, ### LD_LIBRARY_PATH, to point to the build directory: ### setenv LD_LIBRARY_PATH `pwd`:$LD_LIBRARY_PATH; cd t; ./perl harness ### LD_LIBRARY_PATH=`pwd`:$LD_LIBRARY_PATH; export LD_LIBRARY_PATH; cd t; ./perl harness ### export LD_LIBRARY_PATH=`pwd`:$LD_LIBRARY_PATH; cd t; ./perl harness ### for csh-style shells, like tcsh; or for traditional/modern ### Bourne-style shells, like bash, ksh, and zsh, respectively. u=8.28 s=4.16 cu=1238.29 cs=158.08 scripts=1429 tests=186718 make[1]: *** [_test_notty] Error 1 make: *** [_...

Fw: Smoke [5.9.2] 23330 FAIL(X) hp-ux 11.11/64 (PA-2.0/64/2 cpu)
23323 was still OK, 23330 was the next smoke on this machine after 23323 and the first to show this pattern Forwarded by "H.Merijn Brand" <h.m.brand@hccnet.nl> ----------------------- Original Message ----------------------- From: "H.Merijn Brand" <h.m.brand@hccnet.nl> To: smokers-reports@perl.org Date: Tue, 21 Sep 2004 19:20 +0200 Subject: Smoke [5.9.2] 23330 FAIL(X) hp-ux 11.11/64 (PA-2.0/64/2 cpu) ---- Automated smoke report for 5.9.2 patch 23330 r3: PA8800 (PA-2.0/64/2 cpu) on hp-ux - 11.11/64 using gcc versi...

Smoke [5.8.3] 22145 FAIL(F) hp-ux 11.00/64 (PA-2.0/64/2 cpu) #2
Automated smoke report for 5.8.3 patch 22145 a5: PA8700 (PA-2.0/64/2 cpu) on hp-ux - 11.00/64 using gcc version 3.3.2 smoketime 5 hours 11 minutes (average 38 minutes 53 seconds) Summary: FAIL(F) O =3D OK F =3D Failure(s), extended report at the bottom X =3D Failure(s) under TEST but not under harness ? =3D still running or test results not (yet) available Build failures during: - =3D unknown or N/A c =3D Configure, m =3D make, M =3D make (after miniperl), t =3D make test-p= rep 22145 Configuration (common) -Dcc=3Dgcc ----------- --------...

Smoke [5.8.3] 22145 FAIL(F) hp-ux 11.00/64 (PA-2.0/64/2 cpu)
Automated smoke report for 5.8.3 patch 22145 a5: PA8700 (PA-2.0/64/2 cpu) on hp-ux - 11.00/64 using cc version B.11.11.28706.GP smoketime 4 hours 54 minutes (average 36 minutes 47 seconds) Summary: FAIL(F) O =3D OK F =3D Failure(s), extended report at the bottom X =3D Failure(s) under TEST but not under harness ? =3D still running or test results not (yet) available Build failures during: - =3D unknown or N/A c =3D Configure, m =3D make, M =3D make (after miniperl), t =3D make test-p= rep 22145 Configuration (common) none ----------- ----...

Smoke [5.8.4] 23000 FAIL(F) hp-ux 11.00/64 (PA-2.0/64/2 cpu)
Automated smoke report for 5.8.4 patch 23000 a5: PA8700 (PA-2.0/64/2 cpu) on hp-ux - 11.00/64 using gcc version 3.4.0 smoketime 6 hours 11 minutes (average 46 minutes 23 seconds) Summary: FAIL(F) O =3D OK F =3D Failure(s), extended report at the bottom X =3D Failure(s) under TEST but not under harness ? =3D still running or test results not (yet) available Build failures during: - =3D unknown or N/A c =3D Configure, m =3D make, M =3D make (after miniperl), t =3D make test-p= rep 23000 Configuration (common) -Dcc=3Dgcc ----------- --------...

Smoke [5.8.4] 23000 FAIL(XF) hp-ux 11.00/64 (PA-2.0/64/2 cpu)
Automated smoke report for 5.8.4 patch 23000 a5: PA8700 (PA-2.0/64/2 cpu) on hp-ux - 11.00/64 using cc version smoketime 6 hours 5 minutes (average 45 minutes 39 seconds) Summary: FAIL(XF) O =3D OK F =3D Failure(s), extended report at the bottom X =3D Failure(s) under TEST but not under harness ? =3D still running or test results not (yet) available Build failures during: - =3D unknown or N/A c =3D Configure, m =3D make, M =3D make (after miniperl), t =3D make test-p= rep 23000 Configuration (common) none ----------- ---------------------...

Fw: Smoke [5.10.0] 32116 FAIL(F) HP-UX B.11.23/64 (ia64/2 cpu)
Everything older than below passed. I'll dig. Begin forwarded message: Date: Wed, 17 Oct 2007 05:26 +0200 From: "H.Merijn Brand" <h.m.brand@xs4all.nl> To: smokers-reports@perl.org Subject: Smoke [5.10.0] 32116 FAIL(F) HP-UX B.11.23/64 (ia64/2 cpu) Automated smoke report for 5.10.0 patch 32116 x1: Intel(R) Itanium 2 processor/1600 MHz (ia64/2 cpu) on HP-UX - B.11.23/64 using cc version B3910B 32116 Configuration (common) none ----------- --------------------------------------------------------- F F F F F F F F F F F F -Duse64...

Smoke [5.9.0] 21074 FAIL(F) hpux 11.00 (PA-RISC2.0-LP64/2 cpus) #2
Automated smoke report for 5.9.0 patch 21074 on hpux - 11.00 (PA-RISC2.0-LP= 64/2 cpus) (a5) using gcc64 version 3.3 Report by Test::Smoke v1.18.05 (perl 5.8.0) [11 hours 25 minutes] O =3D OK F =3D Failure(s), extended report at the bottom X =3D test(s) failed under TEST but not under harness ? =3D still running or test results not (yet) available Build failures during: - =3D unknown or N/A c =3D Configure, m =3D make, M =3D make (after miniperl), t =3D make test-p= rep 21074 Configuration (common) none ------------ -------------------------------------------------...

Smoke [5.11.2] v5.11.2-185-g7598291 FAIL(F) netbsd 5.0.1 (i386/1 cpu)
Automated smoke report for 5.11.2 patch 759829140078d44db25a91e0ffe11464897ba65d v5.11.2-185-g7598291 p5netbsd: Intel 686-class (i386/1 cpu) on netbsd - 5.0.1 using cc version 4.1.3 20080704 prerelease (NetBSD nb2 20081120) smoketime 6 hours 42 minutes (average 50 minutes 22 seconds) Summary: FAIL(F) O = OK F = Failure(s), extended report at the bottom X = Failure(s) under TEST but not under harness ? = still running or test results not (yet) available Build failures during: - = unknown or N/A c = Configure, m = make, M = make (after miniperl), t = m...

Smoke [5.11.2] v5.11.2-138-gbb61cbb FAIL(F) netbsd 5.0.1 (i386/1 cpu)
Automated smoke report for 5.11.2 patch bb61cbbfe4f34b8082fca34dd9dd82cae6aaa146 v5.11.2-138-gbb61cbb p5netbsd: Intel 686-class (i386/1 cpu) on netbsd - 5.0.1 using cc version 4.1.3 20080704 prerelease (NetBSD nb2 20081120) smoketime 6 hours 34 minutes (average 49 minutes 19 seconds) Summary: FAIL(F) O = OK F = Failure(s), extended report at the bottom X = Failure(s) under TEST but not under harness ? = still running or test results not (yet) available Build failures during: - = unknown or N/A c = Configure, m = make, M = make (after miniperl), t = m...

Smoke [5.11.2] v5.11.2-192-g874e337 FAIL(F) netbsd 5.0.1 (i386/1 cpu)
Automated smoke report for 5.11.2 patch 874e3373547921774d47753e5cb8b5980422af81 v5.11.2-192-g874e337 p5netbsd: Intel 686-class (i386/1 cpu) on netbsd - 5.0.1 using cc version 4.1.3 20080704 prerelease (NetBSD nb2 20081120) smoketime 6 hours 48 minutes (average 51 minutes 6 seconds) Summary: FAIL(F) O = OK F = Failure(s), extended report at the bottom X = Failure(s) under TEST but not under harness ? = still running or test results not (yet) available Build failures during: - = unknown or N/A c = Configure, m = make, M = make (after miniperl), t = ma...

Smoke [5.8.5] 23415 FAIL(F) hp-ux 10.20 (PA-2.0/32/1 cpu) #2
Automated smoke report for 5.8.5 patch 23415 d3: PA8000 (PA-2.0/32/1 cpu) on hp-ux - 10.20 using cc version smoketime 13 hours 7 minutes (average 3 hours 16 minutes) Summary: FAIL(F) O =3D OK F =3D Failure(s), extended report at the bottom X =3D Failure(s) under TEST but not under harness ? =3D still running or test results not (yet) available Build failures during: - =3D unknown or N/A c =3D Configure, m =3D make, M =3D make (after miniperl), t =3D make test-p= rep 23415 Configuration (common) -Dcc-gcc ----------- -----------------------...

Smoke [5.9.0] 21074 FAIL(F) hpux 11.00 (PA-RISC2.0-LP64/2 cpus)
Automated smoke report for 5.9.0 patch 21074 on hpux - 11.00 (PA-RISC2.0-LP= 64/2 cpus) (a5) using gcc64 version 3.3 Report by Test::Smoke v1.18.05 (perl 5.8.0) [11 hours 25 minutes] O =3D OK F =3D Failure(s), extended report at the bottom X =3D test(s) failed under TEST but not under harness ? =3D still running or test results not (yet) available Build failures during: - =3D unknown or N/A c =3D Configure, m =3D make, M =3D make (after miniperl), t =3D make test-p= rep 21074 Configuration (common) none ------------ -------------------------------------------------...

Web resources about - RE: Smoke [5.9.5] 29501 FAIL(F) HP-UX B.11.11/64 (PA-RISC2.0/2 cpu) - perl.perl5.porters

Resources last updated: 2/9/2016 5:51:44 AM