Perl blead issue on macOS 11

--Apple-Mail=_342364C3-7AB1-4816-80DD-F6A80674E553
Content-Transfer-Encoding: quoted-printable
Content-Type: text/plain;
	charset=us-ascii


I just tried to compile blead from github, but it fails on:

ext/DynaLoader/t/DynaLoader ...................................... # =
Failed test 20 - array should contain one result or more: libc =3D> () =
at t/DynaLoader.t line 127
#      got "0"
# expected >=3D "1"
FAILED at test 20

and

dist/Time-HiRes/t/alarm .......................................... #   =
Failed test at t/alarm.t line 116.
# Looks like you failed 1 test of 10.
FAILED at test 2

and this is a warning I guess:

ib/ExtUtils/t/Embed ............................................. Use of =
uninitialized value $thislib in substitution (s///) at =
.../lib/ExtUtils/Liblist/Kid.pm line 72, <DATA> line 53.
Use of uninitialized value $thislib in pattern match (m//) at =
.../lib/ExtUtils/Liblist/Kid.pm line 99, <DATA> line 53.
Use of uninitialized value $thislib in substitution (s///) at =
.../lib/ExtUtils/Liblist/Kid.pm line 106, <DATA> line 53.
Use of uninitialized value $thislib in concatenation (.) or string at =
.../lib/ExtUtils/Liblist/Kid.pm line 114, <DATA> line 53.
Unrecognized argument in LIBS ignored: ''
ok



Full build log available here:

gal.dk/macos11-xcode142-perl-blead.txt =
<http://gal.dk/macos11-xcode142-perl-blead.txt>


And harness output here:

gal.dk/macos11-xcode142-perl-blead-harness.txt =
<http://gal.dk/macos11-xcode142-perl-blead-harness.txt>


Environment: macOS 11.0.1 on Macbook with Apples new M1 chip.

Let me know if there is anything I can do.


Br
Rasmus Skaarup=

--Apple-Mail=_342364C3-7AB1-4816-80DD-F6A80674E553
Content-Transfer-Encoding: quoted-printable
Content-Type: text/html;
	charset=us-ascii

<html><head><meta http-equiv=3D"Content-Type" content=3D"text/html; =
charset=3Dus-ascii"></head><body style=3D"word-wrap: break-word; =
-webkit-nbsp-mode: space; line-break: after-white-space;" class=3D""><div =
class=3D""><br class=3D""></div><div class=3D"">I just tried to compile =
blead from github, but it fails on:</div><div class=3D""><br =
class=3D""></div><div class=3D""><div =
class=3D"">ext/DynaLoader/t/DynaLoader =
....................................... # Failed test 20 - array should =
contain one result or more: libc =3D&gt; () at t/DynaLoader.t line =
127</div><div class=3D""># &nbsp; &nbsp; &nbsp;got "0"</div><div =
class=3D""># expected &gt;=3D "1"</div><div class=3D"">FAILED at test =
20</div></div><div class=3D""><br class=3D""></div><div =
class=3D"">and</div><div class=3D""><br class=3D""></div><div =
class=3D""><div class=3D"">dist/Time-HiRes/t/alarm =
........................................... # &nbsp; Failed test at =
t/alarm.t line 116.</div><div class=3D""># Looks like you failed 1 test =
of 10.</div><div class=3D"">FAILED at test 2</div></div><div =
class=3D""><br class=3D""></div><div class=3D"">and this is a warning I =
guess:</div><div class=3D""><br class=3D""></div><div class=3D""><div =
class=3D"">ib/ExtUtils/t/Embed =
.............................................. Use of uninitialized value =
$thislib in substitution (s///) at ../lib/ExtUtils/Liblist/Kid.pm line =
72, &lt;DATA&gt; line 53.</div><div class=3D"">Use of uninitialized =
value $thislib in pattern match (m//) at ../lib/ExtUtils/Liblist/Kid.pm =
line 99, &lt;DATA&gt; line 53.</div><div class=3D"">Use of uninitialized =
value $thislib in substitution (s///) at ../lib/ExtUtils/Liblist/Kid.pm =
line 106, &lt;DATA&gt; line 53.</div><div class=3D"">Use of =
uninitialized value $thislib in concatenation (.) or string at =
.../lib/ExtUtils/Liblist/Kid.pm line 114, &lt;DATA&gt; line 53.</div><div =
class=3D"">Unrecognized argument in LIBS ignored: ''</div><div =
class=3D"">ok</div></div><div class=3D""><br class=3D""></div><div =
class=3D""><br class=3D""></div><div class=3D""><br class=3D""></div><div =
class=3D"">Full build log available here:</div><div class=3D""><br =
class=3D""></div><div class=3D""><a =
href=3D"http://gal.dk/macos11-xcode142-perl-blead.txt" =
class=3D"">gal.dk/macos11-xcode142-perl-blead.txt</a></div><div =
class=3D""><br class=3D""></div><div class=3D""><br class=3D""></div><div =
class=3D"">And harness output here:</div><div class=3D""><br =
class=3D""></div><div class=3D""><a =
href=3D"http://gal.dk/macos11-xcode142-perl-blead-harness.txt" =
class=3D"">gal.dk/macos11-xcode142-perl-blead-harness.txt</a></div><div =
class=3D""><br class=3D""></div><div class=3D""><br class=3D""></div><div =
class=3D"">Environment: macOS 11.0.1 on Macbook with Apples new M1 =
chip.</div><div class=3D""><br class=3D""></div><div class=3D"">Let me =
know if there is anything I can do.</div><div class=3D""><br =
class=3D""></div><div class=3D""><br class=3D""></div><div =
class=3D"">Br</div><div class=3D"">Rasmus Skaarup</div></body></html>=

--Apple-Mail=_342364C3-7AB1-4816-80DD-F6A80674E553--
0
perl5
11/17/2020 3:09:03 PM
perl.perl5.porters 48254 articles. 1 followers. Follow

0 Replies
11 Views

Similar Articles

[PageSpeed] 4

Reply: