Fw: Smoke [5.9.2] 23330 FAIL(X) hp-ux 11.11/64 (PA-2.0/64/2 cpu)

23323 was still OK, 23330 was the next smoke on this machine after 23323 and
the first to show this pattern

Forwarded by "H.Merijn Brand" <h.m.brand@hccnet.nl>
----------------------- Original Message -----------------------
 From:    "H.Merijn Brand" <h.m.brand@hccnet.nl>
 To:      smokers-reports@perl.org
 Date:    Tue, 21 Sep 2004 19:20 +0200
 Subject: Smoke [5.9.2] 23330 FAIL(X) hp-ux 11.11/64 (PA-2.0/64/2 cpu)
----

Automated smoke report for 5.9.2 patch 23330
r3: PA8800 (PA-2.0/64/2 cpu)
    on        hp-ux - 11.11/64
    using     gcc version 3.4.2
    smoketime 10 hours 29 minutes (average 39 minutes 22 seconds)

Summary: FAIL(X)

O = OK  F = Failure(s), extended report at the bottom
X = Failure(s) under TEST but not under harness
? = still running or test results not (yet) available
Build failures during:       - = unknown or N/A
c = Configure, m = make, M = make (after miniperl), t = make test-prep

   23330     Configuration (common) -Dcc=gcc
----------- ---------------------------------------------------------
O O X O O X 
O O X O O X -Duse64bitall
O O X O O X -Duseithreads
O O X O O X -Duseithreads -Duse64bitall
O O X O O X -Accflags='-DPERL_COPY_ON_WRITE'
O O X O O X -Accflags='-DPERL_COPY_ON_WRITE' -Duse64bitall
O O X O O X -Accflags='-DPERL_COPY_ON_WRITE' -Duseithreads
O O X O O X -Accflags='-DPERL_COPY_ON_WRITE' -Duseithreads -Duse64bitall
| | | | | +- LC_ALL = univ.utf8 -DDEBUGGING
| | | | +--- PERLIO = perlio -DDEBUGGING
| | | +----- PERLIO = stdio  -DDEBUGGING
| | +------- LC_ALL = univ.utf8
| +--------- PERLIO = perlio
+----------- PERLIO = stdio


Failures:
[univ.utf8] -Dcc=gcc
[univ.utf8] -DDEBUGGING -Dcc=gcc
[univ.utf8] -Dcc=gcc -Duse64bitall
[univ.utf8] -DDEBUGGING -Dcc=gcc -Duse64bitall
[univ.utf8] -Dcc=gcc -Duseithreads
[univ.utf8] -DDEBUGGING -Dcc=gcc -Duseithreads
[univ.utf8] -Dcc=gcc -Duseithreads -Duse64bitall
[univ.utf8] -DDEBUGGING -Dcc=gcc -Duseithreads -Duse64bitall
[univ.utf8] -Dcc=gcc -Accflags='-DPERL_COPY_ON_WRITE'
[univ.utf8] -DDEBUGGING -Dcc=gcc -Accflags='-DPERL_COPY_ON_WRITE'
[univ.utf8] -Dcc=gcc -Accflags='-DPERL_COPY_ON_WRITE' -Duse64bitall
[univ.utf8] -DDEBUGGING -Dcc=gcc -Accflags='-DPERL_COPY_ON_WRITE' -Duse64bitall
[univ.utf8] -Dcc=gcc -Accflags='-DPERL_COPY_ON_WRITE' -Duseithreads
[univ.utf8] -DDEBUGGING -Dcc=gcc -Accflags='-DPERL_COPY_ON_WRITE' -Duseithreads
[univ.utf8] -Dcc=gcc -Accflags='-DPERL_COPY_ON_WRITE' -Duseithreads -Duse64bitall
[univ.utf8] -DDEBUGGING -Dcc=gcc -Accflags='-DPERL_COPY_ON_WRITE' -Duseithreads -Duse64bitall
Inconsistent test results (between TEST and harness):
    ../t/io/layers.t........................FAILED at test 0

MANIFEST did not declare 'a.out'

-- 
Report by Test::Smoke v1.19 build 734 running on perl 5.8.5
(Reporter v0.017 / Smoker v0.016)


--------------------- Original Message Ends --------------------

-- 
H.Merijn Brand        Amsterdam Perl Mongers (http://amsterdam.pm.org/)
using perl-5.6.1, 5.8.3, & 5.9.x, and 809 on  HP-UX 10.20 & 11.00, 11i,
   AIX 4.3, SuSE 9.0, and Win2k.           http://www.cmve.net/~merijn/
http://archives.develooper.com/daily-build@perl.org/   perl-qa@perl.org
send smoke reports to: smokers-reports@perl.org, QA: http://qa.perl.org


0
h
9/22/2004 8:54:34 AM
perl.perl5.porters 47902 articles. 1 followers. Follow

2 Replies
916 Views

Similar Articles

[PageSpeed] 46

H.Merijn Brand wrote:
> 23323 was still OK, 23330 was the next smoke on this machine after 23323 and
> the first to show this pattern
....
>    23330     Configuration (common) -Dcc=gcc
> ----------- ---------------------------------------------------------
> O O X O O X 
> O O X O O X -Duse64bitall
> O O X O O X -Duseithreads
> O O X O O X -Duseithreads -Duse64bitall
> O O X O O X -Accflags='-DPERL_COPY_ON_WRITE'
> O O X O O X -Accflags='-DPERL_COPY_ON_WRITE' -Duse64bitall
> O O X O O X -Accflags='-DPERL_COPY_ON_WRITE' -Duseithreads
> O O X O O X -Accflags='-DPERL_COPY_ON_WRITE' -Duseithreads -Duse64bitall
> | | | | | +- LC_ALL = univ.utf8 -DDEBUGGING
> | | | | +--- PERLIO = perlio -DDEBUGGING
> | | | +----- PERLIO = stdio  -DDEBUGGING
> | | +------- LC_ALL = univ.utf8
> | +--------- PERLIO = perlio
> +----------- PERLIO = stdio

I can't reproduce it (maybe I'm just messing up my command lines), but I
think that it has been introduced by Jarkko's patch to encoding and
open, and that there's a typo in lib/open.pm ; could you try the
following ?

Index: lib/open.pm
===================================================================
--- lib/open.pm (revision 3918)
+++ lib/open.pm (working copy)
@@ -37,7 +37,7 @@
     return unless @new >= 1 && $new[-1] =~ /^:encoding\(.+\)$/;
     my @old = PerlIO::get_layers($h);
     return unless @old >= 3 &&
-                 $old[-1] eq 'utf8';
+                 $old[-1] eq 'utf8' &&
                   $old[-2] =~ /^encoding\(.+\)$/;
     my ($loname, $lcname) = _get_encname($old[-2]);
     unless (defined $lcname) { # Should we trust get_layers()?

0
rgarciasuarez
9/22/2004 9:20:53 AM
Rafael Garcia-Suarez wrote:
> I can't reproduce it (maybe I'm just messing up my command lines), but I
> think that it has been introduced by Jarkko's patch to encoding and
> open, and that there's a typo in lib/open.pm ; could you try the
> following ?
> 
> Index: lib/open.pm

Now applied as #23334.

-- 
<@Tux> rgs, your patch fixes the 'X's, please apply
0
rgarciasuarez
9/23/2004 7:54:41 AM
Reply:

Similar Artilces:

Fw: Smoke [5.11.0] 33789 FAIL(F) HP-UX B.11.11/64 (PA-RISC2.0/64/2 cpu)
Below report is still failing in current blead. My analysis was either ignored or missed or not received. Begin forwarded message: Date: Thu, 8 May 2008 13:06:24 +0200 From: "H.Merijn Brand" <h.m.brand@xs4all.nl> To: "H.Merijn Brand" <h.m.brand@xs4all.nl> Cc: smokers-reports@perl.org Subject: Re: Smoke [5.11.0] 33789 FAIL(F) HP-UX B.11.11/64 (PA-RISC2.0/64/2 cpu) On Thu, 8 May 2008 08:26 +0200, "H.Merijn Brand" <h.m.brand@xs4all.nl> wrote: > Automated smoke report for 5.11.0 patch 33789 > r3: PA8800 (PA-RISC2.0/64/2 cpu) ...

Smoke [5.8.3] 22145 FAIL(F) hp-ux 11.00/64 (PA-2.0/64/2 cpu) #2
Automated smoke report for 5.8.3 patch 22145 a5: PA8700 (PA-2.0/64/2 cpu) on hp-ux - 11.00/64 using gcc version 3.3.2 smoketime 5 hours 11 minutes (average 38 minutes 53 seconds) Summary: FAIL(F) O =3D OK F =3D Failure(s), extended report at the bottom X =3D Failure(s) under TEST but not under harness ? =3D still running or test results not (yet) available Build failures during: - =3D unknown or N/A c =3D Configure, m =3D make, M =3D make (after miniperl), t =3D make test-p= rep 22145 Configuration (common) -Dcc=3Dgcc ----------- --------...

Smoke [5.8.3] 22145 FAIL(F) hp-ux 11.00/64 (PA-2.0/64/2 cpu)
Automated smoke report for 5.8.3 patch 22145 a5: PA8700 (PA-2.0/64/2 cpu) on hp-ux - 11.00/64 using cc version B.11.11.28706.GP smoketime 4 hours 54 minutes (average 36 minutes 47 seconds) Summary: FAIL(F) O =3D OK F =3D Failure(s), extended report at the bottom X =3D Failure(s) under TEST but not under harness ? =3D still running or test results not (yet) available Build failures during: - =3D unknown or N/A c =3D Configure, m =3D make, M =3D make (after miniperl), t =3D make test-p= rep 22145 Configuration (common) none ----------- ----...

Smoke [5.8.4] 23000 FAIL(XF) hp-ux 11.00/64 (PA-2.0/64/2 cpu)
Automated smoke report for 5.8.4 patch 23000 a5: PA8700 (PA-2.0/64/2 cpu) on hp-ux - 11.00/64 using cc version smoketime 6 hours 5 minutes (average 45 minutes 39 seconds) Summary: FAIL(XF) O =3D OK F =3D Failure(s), extended report at the bottom X =3D Failure(s) under TEST but not under harness ? =3D still running or test results not (yet) available Build failures during: - =3D unknown or N/A c =3D Configure, m =3D make, M =3D make (after miniperl), t =3D make test-p= rep 23000 Configuration (common) none ----------- ---------------------...

Smoke [5.8.4] 23000 FAIL(F) hp-ux 11.00/64 (PA-2.0/64/2 cpu)
Automated smoke report for 5.8.4 patch 23000 a5: PA8700 (PA-2.0/64/2 cpu) on hp-ux - 11.00/64 using gcc version 3.4.0 smoketime 6 hours 11 minutes (average 46 minutes 23 seconds) Summary: FAIL(F) O =3D OK F =3D Failure(s), extended report at the bottom X =3D Failure(s) under TEST but not under harness ? =3D still running or test results not (yet) available Build failures during: - =3D unknown or N/A c =3D Configure, m =3D make, M =3D make (after miniperl), t =3D make test-p= rep 23000 Configuration (common) -Dcc=3Dgcc ----------- --------...

RE: Smoke [5.9.5] 29501 FAIL(F) HP-UX B.11.11/64 (PA-RISC2.0/2 cpu)
From http://beta.nntp.perl.org/group/perl.daily-build.reports/2006/12/msg43142.html : [stdio] -DDEBUGGING -Duseithreads ../ext/threads/t/libc.t.................FAILED 9-10 12 [perlio] -DDEBUGGING -Duseithreads ../ext/threads/t/libc.t.................FAILED 5-6 9 11-12 [univ.utf8] -DDEBUGGING -Duseithreads ../ext/threads/t/libc.t.................FAILED 4-8 10-11 This shows that 'localtime' is not thread-safe under this HP-UX build. Anyone have a clue as to why and/or how to fix it? ____________________________________________________________________...

Fw: Smoke [5.10.0] 32093 FAIL(F) HP-UX B.11.00/64 (PA-RISC2.0/64/2 cpu)
### You may have to set your dynamic library search path, ### LD_LIBRARY_PATH, to point to the build directory: ### setenv LD_LIBRARY_PATH `pwd`:$LD_LIBRARY_PATH; cd t; ./perl harness ### LD_LIBRARY_PATH=`pwd`:$LD_LIBRARY_PATH; export LD_LIBRARY_PATH; cd t; ./perl harness ### export LD_LIBRARY_PATH=`pwd`:$LD_LIBRARY_PATH; cd t; ./perl harness ### for csh-style shells, like tcsh; or for traditional/modern ### Bourne-style shells, like bash, ksh, and zsh, respectively. u=8.28 s=4.16 cu=1238.29 cs=158.08 scripts=1429 tests=186718 make[1]: *** [_test_notty] Error 1 make: *** [_...

Fw: Smoke [5.10.0] 32116 FAIL(F) HP-UX B.11.23/64 (ia64/2 cpu)
Everything older than below passed. I'll dig. Begin forwarded message: Date: Wed, 17 Oct 2007 05:26 +0200 From: "H.Merijn Brand" <h.m.brand@xs4all.nl> To: smokers-reports@perl.org Subject: Smoke [5.10.0] 32116 FAIL(F) HP-UX B.11.23/64 (ia64/2 cpu) Automated smoke report for 5.10.0 patch 32116 x1: Intel(R) Itanium 2 processor/1600 MHz (ia64/2 cpu) on HP-UX - B.11.23/64 using cc version B3910B 32116 Configuration (common) none ----------- --------------------------------------------------------- F F F F F F F F F F F F -Duse64...

Smoke [5.11.2] v5.11.2-51-ge90d614 FAIL(F) Solaris 2.11 (i386/1 cpu)
Automated smoke report for 5.11.2 patch e90d6148cab189f145114468e60a00cfb4e= 3ec90 v5.11.2-51-ge90d614 perl-opensolaris: i86pc (2614MHz) (i386/1 cpu) on Solaris - 2.11 using cc version Sun Ceres C 5.10 SunOS_i386 2009/03/06 smoketime 16 hours 45 minutes (average 1 hour 2 minutes) Summary: FAIL(F) O =3D OK F =3D Failure(s), extended report at the bottom X =3D Failure(s) under TEST but not under harness ? =3D still running or test results not (yet) available Build failures during: - =3D unknown or N/A c =3D Configure, m =3D make, M =3D make (after min...

Smoke [5.11.2] v5.11.2-66-g6b1226d FAIL(F) Solaris 2.11 (i386/1 cpu)
Automated smoke report for 5.11.2 patch 6b1226db4432ba7f08619ebe4c5365f692d= cbbf7 v5.11.2-66-g6b1226d perl-opensolaris: i86pc (2614MHz) (i386/1 cpu) on Solaris - 2.11 using cc version Sun Ceres C 5.10 SunOS_i386 2009/03/06 smoketime 16 hours 51 minutes (average 1 hour 3 minutes) Summary: FAIL(F) O =3D OK F =3D Failure(s), extended report at the bottom X =3D Failure(s) under TEST but not under harness ? =3D still running or test results not (yet) available Build failures during: - =3D unknown or N/A c =3D Configure, m =3D make, M =3D make (after min...

Smoke [5.11.2] v5.11.2-78-g17cc935 FAIL(F) Solaris 2.11 (i386/1 cpu)
Automated smoke report for 5.11.2 patch 17cc9359ea8ee1b546aa067b91362160e3c= 1e1ee v5.11.2-78-g17cc935 perl-opensolaris: i86pc (2614MHz) (i386/1 cpu) on Solaris - 2.11 using cc version Sun Ceres C 5.10 SunOS_i386 2009/03/06 smoketime 17 hours 24 minutes (average 1 hour 5 minutes) Summary: FAIL(F) O =3D OK F =3D Failure(s), extended report at the bottom X =3D Failure(s) under TEST but not under harness ? =3D still running or test results not (yet) available Build failures during: - =3D unknown or N/A c =3D Configure, m =3D make, M =3D make (after min...

Smoke [5.11.2] v5.11.2-169-g827da6a FAIL(XF) Solaris 2.11 (i386/1 cpu)
Automated smoke report for 5.11.2 patch 827da6a38269ebe059fe8acab0772f00c88= 704bf v5.11.2-169-g827da6a perl-opensolaris: i86pc (2614MHz) (i386/1 cpu) on Solaris - 2.11 using cc version Sun Ceres C 5.10 SunOS_i386 2009/03/06 smoketime 13 hours 11 minutes (average 49 minutes 28 seconds) Summary: FAIL(XF) O =3D OK F =3D Failure(s), extended report at the bottom X =3D Failure(s) under TEST but not under harness ? =3D still running or test results not (yet) available Build failures during: - =3D unknown or N/A c =3D Configure, m =3D make, M =3D make (af...

Smoke [5.11.2] v5.11.2-69-g789c461 FAIL(F) Solaris 2.11 (i386/1 cpu)
Automated smoke report for 5.11.2 patch 789c461534f3eb0346447f8127786b7da30= 17f6c v5.11.2-69-g789c461 perl-opensolaris: i86pc (2614MHz) (i386/1 cpu) on Solaris - 2.11 using cc version Sun Ceres C 5.10 SunOS_i386 2009/03/06 smoketime 16 hours 27 minutes (average 1 hour 1 minute) Summary: FAIL(F) O =3D OK F =3D Failure(s), extended report at the bottom X =3D Failure(s) under TEST but not under harness ? =3D still running or test results not (yet) available Build failures during: - =3D unknown or N/A c =3D Configure, m =3D make, M =3D make (after mini...

Smoke [5.11.2] v5.11.2-81-g162177c FAIL(F) Solaris 2.11 (i386/1 cpu)
Automated smoke report for 5.11.2 patch 162177c1aed1991639f7f0da64e918c034e= 1148a v5.11.2-81-g162177c perl-opensolaris: i86pc (2614MHz) (i386/1 cpu) on Solaris - 2.11 using cc version Sun Ceres C 5.10 SunOS_i386 2009/03/06 smoketime 17 hours 18 minutes (average 1 hour 4 minutes) Summary: FAIL(F) O =3D OK F =3D Failure(s), extended report at the bottom X =3D Failure(s) under TEST but not under harness ? =3D still running or test results not (yet) available Build failures during: - =3D unknown or N/A c =3D Configure, m =3D make, M =3D make (after min...

Web resources about - Fw: Smoke [5.9.2] 23330 FAIL(X) hp-ux 11.11/64 (PA-2.0/64/2 cpu) - perl.perl5.porters

Smoke - Wikipedia, the free encyclopedia
emitted when a material undergoes combustion or pyrolysis , together with the quantity of air that is entrained or otherwise mixed into the mass. ...

Smoke Et Al (@SmokeEtAl) on Twitter
Sign in Sign up To bring you Twitter, we and our partners use cookies on our and other websites. Cookies help personalize Twitter content, tailor ...

Abstract Smoke FX for iPhone, iPod touch, and iPad on the iTunes App Store
Get Abstract Smoke FX on the App Store. See screenshots and ratings, and read customer reviews.


Smoke on the water: Cabin cruiser bursts into flames at North Fremantle
A man was rescued from a cabin cruiser after it burst into flames on the Swan River at North Fremantle on Sunday morning.

Neighbours don't have to put up with second-hand smoke in strata buildings
Hefty damages awarded to a tenant may signal a new era in smoke-free living for apartment dwellers.

'Suspicious' blaze at Dandenong drug court blankets area in smoke
... arson attack could be behind a huge fire at the Dandenong drug court, which will continue to blanket surrounding&nbsp;areas with smoke for several ...

Mixed Smoke Signals For Tribal Marijuana From DOJ
Why have so many Tribal marijuana experiments been met with DOJ resistance? Is the DOJ treating Tribes more harshly than it treats the states? ...

Rihanna Marijuana News Trail Goes Up in Smoke
How many red flags do you see in the following paragraph ?: While speaking at a cannabis convention in Negril, Jamaica this week, Rihanna announced ...

Billions of Barrels of Oil Vanish in a Puff of Accounting Smoke
In an instant, Chesapeake Energy Corp. will erase the equivalent of 1.1 billion barrels of oil from its books.

Resources last updated: 12/16/2015 4:15:38 AM