DBD::ODBC 0.43 tests failed under cygwin perl 5.8.0 DBI 1.30 on N T4 SP 6a MERANT 5 32 bit ODBC driver 0.52.00.00

------_=_NextPart_001_01C28FBF.39892550
Content-Type: text/plain; charset="iso-8859-1"


bash-2.05b$ perl -V
Summary of my perl5 (revision 5.0 version 8 subversion 0) configuration:
  Platform:
    osname=cygwin, osvers=1.3.12(0.5432), archname=cygwin-multi-64int
    uname='cygwin_nt-5.0 kmbestst 1.3.12(0.5432) 2002-07-06 02:16 i686
unknown '
    config_args='-de -Dmksymlinks -Dusemultiplicity -Duse64bitint
-Doptimize=-O2 -Dman3ext=3pm'
    hint=recommended, useposix=true, d_sigaction=define
    usethreads=undef use5005threads=undef useithreads=undef
usemultiplicity=define
    useperlio=define d_sfio=undef uselargefiles=define usesocks=undef
    use64bitint=define use64bitall=undef uselongdouble=undef
    usemymalloc=y, bincompat5005=undef
  Compiler:
    cc='gcc', ccflags ='-DPERL_USE_SAFE_PUTENV -fno-strict-aliasing',
    optimize='-O2',
    cppflags='-DPERL_USE_SAFE_PUTENV -fno-strict-aliasing'
    ccversion='', gccversion='3.1.1 20020718 (prerelease)', gccosandvers=''
    intsize=4, longsize=4, ptrsize=4, doublesize=8, byteorder=12345678
    d_longlong=define, longlongsize=8, d_longdbl=define, longdblsize=12
    ivtype='long long', ivsize=8, nvtype='double', nvsize=8, Off_t='off_t',
lseeksize=4
    alignbytes=8, prototype=define
  Linker and Libraries:
    ld='ld2', ldflags =' -s -L/usr/local/lib'
    libpth=/usr/local/lib /usr/lib /lib
    libs=-lgdbm -lcrypt -lutil
    perllibs=-lcrypt -lutil
    libc=/usr/lib/libc.a, so=dll, useshrplib=true, libperl=libperl.a
    gnulibc_version=''
  Dynamic Linking:
    dlsrc=dl_dlopen.xs, dlext=dll, d_dlsymun=undef, ccdlflags=' -s'
    cccdlflags=' ', lddlflags=' -s -L/usr/local/lib'


Characteristics of this binary (from libperl): 
  Compile-time options: MULTIPLICITY USE_64_BIT_INT USE_LARGE_FILES
PERL_IMPLICIT_CONTEXT
  Built under cygwin
  Compiled at Jul 24 2002 18:47:09
  %ENV:
    CYGWIN=""
  @INC:
    /usr/lib/perl5/5.8.0/cygwin-multi-64int
    /usr/lib/perl5/5.8.0
    /usr/lib/perl5/site_perl/5.8.0/cygwin-multi-64int
    /usr/lib/perl5/site_perl/5.8.0
    /usr/lib/perl5/site_perl
    .
bash-2.05b$ 
bash-2.05b$ perl Makefile.PL
Using ODBC in C:/WINNT

Umm, this looks like a Microsoft ODBC type of driver manager.

Configuring DBD::ODBC ...

>>>	Remember to actually *READ* the README file!
   	And re-read it if you have any problems.

Using DBI 1.30 installed in
/usr/lib/perl5/site_perl/5.8.0/cygwin-multi-64int/auto/DBI

Building for Microsoft under Cygwin

Checking if your kit is complete...
Looks good
Using DBI 1.30 installed in
/usr/lib/perl5/site_perl/5.8.0/cygwin-multi-64int/auto/DBI
Writing Makefile for DBD::ODBC

The DBD::ODBC tests will use these values for the database connection:
    DBI_DSN=dbi:ODBC:t543		e.g. dbi:ODBC:demo
    DBI_USER=itsmb
    DBI_PASS=abc123

bash-2.05b$ make
cp ODBC.pm blib/lib/DBD/ODBC.pm
/bin/perl.exe -p -e "s/~DRIVER~/ODBC/g" <
/usr/lib/perl5/site_perl/5.8.0/cygwin-multi-64int/auto/DBI/Driver.xst >
ODBC.xsi
/bin/perl.exe /usr/lib/perl5/5.8.0/ExtUtils/xsubpp  -typemap
/usr/lib/perl5/5.8.0/ExtUtils/typemap  ODBC.xs > ODBC.xsc && mv ODBC.xsc
ODBC.c
gcc -c  -I. -I/usr/lib/perl5/site_perl/5.8.0/cygwin-multi-64int/auto/DBI
-I/usr/include/w32api -DPERL_USE_SAFE_PUTENV -fno-strict-aliasing
-DUSEIMPORTLIB -O2   -DVERSION=\"0.43\" -DXS_VERSION=\"0.43\"
"-I/usr/lib/perl5/5.8.0/cygwin-multi-64int/CORE"   ODBC.c
gcc -c  -I. -I/usr/lib/perl5/site_perl/5.8.0/cygwin-multi-64int/auto/DBI
-I/usr/include/w32api -DPERL_USE_SAFE_PUTENV -fno-strict-aliasing
-DUSEIMPORTLIB -O2   -DVERSION=\"0.43\" -DXS_VERSION=\"0.43\"
"-I/usr/lib/perl5/5.8.0/cygwin-multi-64int/CORE"   dbdimp.c
dbdimp.c: In function `odbc_db_login6':
dbdimp.c:243: warning: cast to pointer from integer of different size
dbdimp.c: At top level:
dbdimp.c:1809: warning: `_dbd_rebind_ph' was declared implicitly `extern'
and later `static'
dbdimp.c:1311: warning: previous declaration of `_dbd_rebind_ph'
Running Mkbootstrap for DBD::ODBC ()
chmod 644 ODBC.bs
rm -f blib/arch/auto/DBD/ODBC/ODBC.dll
LD_RUN_PATH="/usr/lib/w32api" ld2  -s -L/usr/local/lib ODBC.o dbdimp.o
-lodbc32 -o blib/arch/auto/DBD/ODBC/ODBC.dll
/usr/lib/perl5/5.8.0/cygwin-multi-64int/CORE/libperl.dll.a -L/usr/lib/w32api
-lodbc32  
gcc -shared -o  ODBC.dll -Wl,--out-implib=libODBC.dll.a
-Wl,--export-all-symbols -Wl,--enable-auto-import -Wl,--stack,8388608 \
-s -L/usr/local/lib ODBC.o dbdimp.o -lodbc32
/usr/lib/perl5/5.8.0/cygwin-multi-64int/CORE/libperl.dll.a -L/usr/lib/w32api
-lodbc32
Creating library file: libODBC.dll.a
mv ODBC.dll libODBC.dll.a blib/arch/auto/DBD/ODBC/
chmod 755 blib/arch/auto/DBD/ODBC/ODBC.dll
cp ODBC.bs blib/arch/auto/DBD/ODBC/ODBC.bs
chmod 644 blib/arch/auto/DBD/ODBC/ODBC.bs
Manifying blib/man3/DBD.ODBC.3pm
bash-2.05b$ make test TEST_VERBOSE=1
/bin/perl.exe "-MExtUtils::Command::MM" "-e" "test_harness(1, 'blib/lib',
'blib/arch')" t/*.t
t/01base......1..5
ok 1
ok 2
ok 3
ok 4
ok 5
ok
t/02simple....1..17
ok 1
 Test 2: connecting to the database
ok 2
 Test 3: create test table
Using fields: COL_A NUMBER(38,0), COL_B VARCHAR2(4000), COL_C CLOB, COL_D
DATE
ok 3
 Test 4: check existance of test table
(unknown owner).PERL_DBD_TEST
ok 4
 Test 5: insert test data
ok 5
 Test 6: select test data
1|foo|foo varchar|
2|bar|bar varchar|
3|bletch|bletch varchar|
4|80char|THIS IS A STRING LONGER THAN 80 CHARS.  THIS SHOULD BE CHECKED FOR
TRUNCATION AND COMPARED WITH ITSELF.|
5|gt250char|THIS IS A STRING LONGER THAN 80 CHARS.  THIS SHOULD BE CHECKED
FOR TRUNCATION AND COMPARED WITH ITSELF.  THIS IS A STRING LONGER THAN 80
CHARS.  THIS SHOULD BE CHECKED FOR TRUNCATION AND COMPARED WITH ITSELF.
THIS IS A STRING LONGER THAN 80 CHARS.  THIS SHOULD BE CHECKED FOR
TRUNCATION AND COMPARED WITH ITSELF.  THIS IS A STRING LONGER THAN 80 CHARS.
THIS SHOULD BE CHECKED FOR TRUNCATION AND COMPARED WITH ITSELF.|
retrieved 103 byte string OK
retrieved 418 byte string OK
ok 6
 Tests 7,8: test LongTruncOk
ok 7
ok 8
 Test 9: test ColAttributes
Column count is: 4
1: COL_A = 3
2: COL_B = 12
3: COL_C = -1
4: COL_D = 11
ok 9
 Test 10: test $DBI::err
ok 10
 Test 11: test date values
ok 11
 Test 12: test group by queries
1, 1
2, 1
3, 1
4, 1
5, 1
ok 12
 Test 13: test data_sources
Data sources:
	DBI:ODBC:MS Access Database
	DBI:ODBC:dBASE Files
	DBI:ODBC:Excel Files
	DBI:ODBC:Visual FoxPro Database
	DBI:ODBC:Visual FoxPro Tables
	DBI:ODBC:dBase Files - Word
	DBI:ODBC:FoxPro Files - Word
	DBI:ODBC:tsc-sec
	DBI:ODBC:nmu1::i32::t536
	DBI:ODBC:MQIS
	DBI:ODBC:t543
	DBI:ODBC:heat2000

ok 13
 Test 14: test ping method
ok 14
 Test 15: test storing of DBH parameter
ok 15
Attrib not true (1)
ok 16
 Test 17: test get_info
 connected to Oracle
ok 17
ok
t/03dbatt.....1..9
ok 1
ok 2
ok 3
ok 4
ok 5
ok 6
ok 7
ok 8
ok 9
ok
t/05meth......1..6
ok 1
ok 2
ok 3
ok 4
ok 5
ok 6
calling finish
resetting attributes
disconnecting
disconnected
ok
t/07bind......1..9
ok 1
 Test 2: connecting to the database
ok 2
 Test 3: create test table
Using fields: COL_A NUMBER(38,0), COL_B VARCHAR2(4000), COL_C CLOB, COL_D
DATE
ok 3
 Test 4: insert test data
DBD::ODBC::st execute failed: [MERANT][ODBC SequeLink driver]Numeric value
out of range.  Error in parameter 1. (SQL-22003)(DBD: st_execute/SQLExecute
err=-1) at t/ODBCTEST.pm line 210.
Binding the value: 1 type = 3
SQL_DATE = 9 SQL_TIMESTAMP = 11
TYPE FOUND = 11
Test 4 is known to fail often. It is not a major concern.  It *may* be an
indication of being unable to bind datetime values correctly.
not ok 4
 Test 5: select test data
DBD::ODBC::st fetchrow failed: [MERANT][ODBC SequeLink driver][SequeLink
Client]An internal error occurred. (SQL-S1000)
[MERANT][ODBC SequeLink driver][SequeLink
Client]ora8srv.swora8.7058.Internal error, fatal server error detected.
 (SQL-S1000)(DBD: st_fetch/SQLFetch err=-1) at t/07bind.t line 107.
DBD::ODBC::st fetchrow failed: [MERANT][ODBC SequeLink driver][SequeLink
Client]An internal error occurred. (SQL-S1000)
[MERANT][ODBC SequeLink driver][SequeLink
Client]ora8srv.swora8.7058.Internal error, fatal server error detected.
 (SQL-S1000)(DBD: st_fetch/SQLFetch err=-1) at t/07bind.t line 107.
ok 5
 Test 6: insert long test data
DBD::ODBC::st execute failed: [MERANT][ODBC SequeLink driver]Numeric value
out of range.  Error in parameter 1. (SQL-22003)(DBD: st_execute/SQLExecute
err=-1) at t/ODBCTEST.pm line 210.
Binding the value: 4 type = 3
SQL_DATE = 9 SQL_TIMESTAMP = 11
TYPE FOUND = 11
Since test #4 failed, this could be indicative of a problem with date time
binding, as per #4 above.
not ok 6
 Test 7: check long test data
DBD::ODBC::st fetchrow failed: [MERANT][ODBC SequeLink driver][SequeLink
Client]An internal error occurred. (SQL-S1000)
[MERANT][ODBC SequeLink driver][SequeLink
Client]ora8srv.swora8.7058.Internal error, fatal server error detected.
 (SQL-S1000)(DBD: st_fetch/SQLFetch err=-1) at t/07bind.t line 107.
DBD::ODBC::st fetchrow failed: [MERANT][ODBC SequeLink driver][SequeLink
Client]An internal error occurred. (SQL-S1000)
[MERANT][ODBC SequeLink driver][SequeLink
Client]ora8srv.swora8.7058.Internal error, fatal server error detected.
 (SQL-S1000)(DBD: st_fetch/SQLFetch err=-1) at t/07bind.t line 107.
ok 7
 Test 8: update long test data
DBD::ODBC::st execute failed: [MERANT][ODBC SequeLink driver]Numeric value
out of range.  Error in parameter 2. (SQL-22003)(DBD: st_execute/SQLExecute
err=-1) at t/07bind.t line 143.
not ok 8
 Test 9: check long test data
DBD::ODBC::st fetchrow failed: [MERANT][ODBC SequeLink driver][SequeLink
Client]An internal error occurred. (SQL-S1000)
[MERANT][ODBC SequeLink driver][SequeLink
Client]ora8srv.swora8.7058.Internal error, fatal server error detected.
 (SQL-S1000)(DBD: st_fetch/SQLFetch err=-1) at t/07bind.t line 107.
DBD::ODBC::st fetchrow failed: [MERANT][ODBC SequeLink driver][SequeLink
Client]An internal error occurred. (SQL-S1000)
[MERANT][ODBC SequeLink driver][SequeLink
Client]ora8srv.swora8.7058.Internal error, fatal server error detected.
 (SQL-S1000)(DBD: st_fetch/SQLFetch err=-1) at t/07bind.t line 107.
ok 9
FAILED tests 4, 6, 8
	Failed 3/9 tests, 66.67% okay
t/08bind2.....SQLDescribeParam not supported under Oracle
1..0
skipped
        all skipped: no reason given
t/09multi.....1..0
DBD::ODBC::st execute failed: [MERANT][ODBC SequeLink
driver][Oracle]ORA-00933: SQL command not properly ended
 (SQL-S1000)(DBD: st_execute/SQLExecute err=-1) at t/09multi.t line 46.
skipped
        all skipped: no reason given
Failed 1/7 test scripts, 85.71% okay. 3/46 subtests failed, 93.48% okay.
Failed Test Stat Wstat Total Fail  Failed  List of Failed
----------------------------------------------------------------------------
---
t/07bind.t                 9    3  33.33%  4 6 8
2 tests skipped.
make: *** [test_dynamic] Error 14
bash-2.05b$ 



**********************************************************************
This email and any files transmitted with it are confidential and
intended solely for the use of the individual or entity to whom they
are addressed. If you have received this email in error please notify
the system manager.

This footnote also confirms that this email message has been swept by
MIMEsweeper for the presence of computer viruses.

www.mimesweeper.com
**********************************************************************


------_=_NextPart_001_01C28FBF.39892550--
0
mark
11/19/2002 11:31:38 AM
perl.dbi.users 11099 articles. 1 followers. Follow

1 Replies
795 Views

Similar Articles

[PageSpeed] 11

------=_NextPart_000_0010_01C28FB7.3CC9A3F0
Content-Type: text/plain;
	charset="iso-8859-1"
Content-Transfer-Encoding: 7bit

DBD::ODBC 0.43 tests failed under cygwin perl 5.8.0 DBI 1.30 on NT4 SP 6a
MERANT 5 32 bit ODBC driver 0.52.00.00That's the driver.  It seems that
everything else is ok, but the bind parameter stuff.  0.43_xx might be
better for you, as the tests have been improved...

Regards

Jeff
  t/07bind......1..9
  ok 1
   Test 2: connecting to the database
  ok 2
   Test 3: create test table
  Using fields: COL_A NUMBER(38,0), COL_B VARCHAR2(4000), COL_C CLOB, COL_D
DATE
  ok 3
   Test 4: insert test data
  DBD::ODBC::st execute failed: [MERANT][ODBC SequeLink driver]Numeric value
out of range.  Error in parameter 1. (SQL-22003)(DBD: st_execute/SQLExecute
err=-1) at t/ODBCTEST.pm line 210.
  Binding the value: 1 type = 3
  SQL_DATE = 9 SQL_TIMESTAMP = 11
  TYPE FOUND = 11
  Test 4 is known to fail often. It is not a major concern.  It *may* be an
indication of being unable to bind datetime values correctly.

  not ok 4
   Test 5: select test data
  DBD::ODBC::st fetchrow failed: [MERANT][ODBC SequeLink driver][SequeLink
Client]An internal error occurred. (SQL-S1000)
  [MERANT][ODBC SequeLink driver][SequeLink
Client]ora8srv.swora8.7058.Internal error, fatal server error detected.
   (SQL-S1000)(DBD: st_fetch/SQLFetch err=-1) at t/07bind.t line 107.
  DBD::ODBC::st fetchrow failed: [MERANT][ODBC SequeLink driver][SequeLink
Client]An internal error occurred. (SQL-S1000)
  [MERANT][ODBC SequeLink driver][SequeLink
Client]ora8srv.swora8.7058.Internal error, fatal server error detected.
   (SQL-S1000)(DBD: st_fetch/SQLFetch err=-1) at t/07bind.t line 107.
  ok 5
   Test 6: insert long test data
  DBD::ODBC::st execute failed: [MERANT][ODBC SequeLink driver]Numeric value
out of range.  Error in parameter 1. (SQL-22003)(DBD: st_execute/SQLExecute
err=-1) at t/ODBCTEST.pm line 210.

  Binding the value: 4 type = 3
  SQL_DATE = 9 SQL_TIMESTAMP = 11
  TYPE FOUND = 11
  Since test #4 failed, this could be indicative of a problem with date time
binding, as per #4 above.
  not ok 6
   Test 7: check long test data
  DBD::ODBC::st fetchrow failed: [MERANT][ODBC SequeLink driver][SequeLink
Client]An internal error occurred. (SQL-S1000)
  [MERANT][ODBC SequeLink driver][SequeLink
Client]ora8srv.swora8.7058.Internal error, fatal server error detected.
   (SQL-S1000)(DBD: st_fetch/SQLFetch err=-1) at t/07bind.t line 107.
  DBD::ODBC::st fetchrow failed: [MERANT][ODBC SequeLink driver][SequeLink
Client]An internal error occurred. (SQL-S1000)
  [MERANT][ODBC SequeLink driver][SequeLink
Client]ora8srv.swora8.7058.Internal error, fatal server error detected.
   (SQL-S1000)(DBD: st_fetch/SQLFetch err=-1) at t/07bind.t line 107.
  ok 7
   Test 8: update long test data
  DBD::ODBC::st execute failed: [MERANT][ODBC SequeLink driver]Numeric value
out of range.  Error in parameter 2. (SQL-22003)(DBD: st_execute/SQLExecute
err=-1) at t/07bind.t line 143.

  not ok 8
   Test 9: check long test data
  DBD::ODBC::st fetchrow failed: [MERANT][ODBC SequeLink driver][SequeLink
Client]An internal error occurred. (SQL-S1000)
  [MERANT][ODBC SequeLink driver][SequeLink
Client]ora8srv.swora8.7058.Internal error, fatal server error detected.
   (SQL-S1000)(DBD: st_fetch/SQLFetch err=-1) at t/07bind.t line 107.
  DBD::ODBC::st fetchrow failed: [MERANT][ODBC SequeLink driver][SequeLink
Client]An internal error occurred. (SQL-S1000)
  [MERANT][ODBC SequeLink driver][SequeLink
Client]ora8srv.swora8.7058.Internal error, fatal server error detected.
   (SQL-S1000)(DBD: st_fetch/SQLFetch err=-1) at t/07bind.t line 107.
  ok 9
  FAILED tests 4, 6, 8
          Failed 3/9 tests, 66.67% okay
  t/08bind2.....SQLDescribeParam not supported under Oracle
  1..0
  skipped
          all skipped: no reason given
  t/09multi.....1..0
  DBD::ODBC::st execute failed: [MERANT][ODBC SequeLink
driver][Oracle]ORA-00933: SQL command not properly ended
   (SQL-S1000)(DBD: st_execute/SQLExecute err=-1) at t/09multi.t line 46.
  skipped
          all skipped: no reason given
  Failed 1/7 test scripts, 85.71% okay. 3/46 subtests failed, 93.48% okay.
  Failed Test Stat Wstat Total Fail  Failed  List of Failed
  --------------------------------------------------------------------------
-----
  t/07bind.t                 9    3  33.33%  4 6 8
  2 tests skipped.
  make: *** [test_dynamic] Error 14
  bash-2.05b$



  **********************************************************************
  This email and any files transmitted with it are confidential and
  intended solely for the use of the individual or entity to whom they
  are addressed. If you have received this email in error please notify
  the system manager.

  This footnote also confirms that this email message has been swept by
  MIMEsweeper for the presence of computer viruses.

  www.mimesweeper.com
  **********************************************************************

------=_NextPart_000_0010_01C28FB7.3CC9A3F0--


0
jurlwin
11/19/2002 3:34:28 PM
Reply:

Similar Artilces:

SM2.5 crash
I got those traps when trying to 'Edit as new'(?) a previous sent mail and wanted to change the language via right click in subject line. Was reproduce able a few times but now it works. Maybe I tried to fast switching spell checker? ------------------------------------------------------------ 12-06-2011 21:37:47 SYS3171 PID 006e TID 0001 Slot 0077 P:\SEAMONKEY2\SEA!LRQ.EXE c0000005 14dd6ac8 P1=00000002 P2=0002fffc P3=XXXXXXXX P4=XXXXXXXX EAX=00030064 EBX=00030180 ECX=00030180 EDX=27a22940 ESI=24c5ee88 EDI=24c5ee88 DS=0053 DSACC=f0f3 DSLIM=ffffffff ES=0053...

Errors using hotmail after latest major update: Mozilla/5.0 (Windows; U; Windows NT 5.1; en-US; rv:1.8.0.8) Gecko/20061025 Firefox/1.5.0.8
Name: William Green Email: wjgreen_at_hotmail.com Product: Firefox Summary: Errors using hotmail after latest major update: Mozilla/5.0 (Windows; U; Windows NT 5.1; en-US; rv:1.8.0.8) Gecko/20061025 Firefox/1.5.0.8 Comments: After I installed the latest update and rebooted, every time I go to open an email in hotmail.com (this does NOT occur in other email sites I use), I get the following three Alert messages that I have to click through to get to my email: [object XPCNativeWrapper [object HTMLBodyElement]] [object XPCNativeWrapper [object HTMLScriptElement]] TypeError: d...

stalled transfer Mozilla/5.0 (X11; U; Linux i686; en-GB; rv:1.8.0.3) Gecko/20060425 SUSE/1.5.0.3-7 Firefox/1.5.0.3
I experience stalled or no download of all (not only specific web-sites) using firefox while another browser "Konquereor" is working normally. Firefox is looking up.. connecting... transferring and then stalled sometimes I get the message "I cant find the server", surprisingly because the status shows transferring, or a login window for the router shows up what has not been seen with the other web browser. A second Linux PC in the network is working as supposed, the router is wide open... connection settings are already checked. May be anybody has a hint? ...

stalled or no download: Mozilla/5.0 (X11; U; Linux i686; en-GB; rv:1.8.0.3) Gecko/20060425 SUSE/1.5.0.3-7 Firefox/1.5.0.3
I experience stalled or no download of all (not only specific web-sites) using firefox while another browser "Konquereor" is working normally. Firefox is looking up.. connecting... transfering and then stalled sometimes I get the message "I cant find the server", suprisingly because the status shows transfering, or a login window for the router shows up what has not been seen with the other web browser. A second Linux PC in the network is working as supposed, the router is wide open... connection settings are alredy checked. May be anybody has a hint? Ber...

Smoke [5.8.2] 21949 FAIL(Mc) cygwin_nt-5.0 1.5.5(0.94/3/2) (i686/1 cpu)
Automated smoke report for 5.8.2 patch 21949 on cygwin_nt-5.0 - 1.5.5(0.94/= 3/2) (i686/1 cpu) (PC09) using version=20 Report by Test::Smoke v1.18.11 (perl 5.8.2) [1 hour 13 minutes] O =3D OK F =3D Failure(s), extended report at the bottom X =3D test(s) failed under TEST but not under harness ? =3D still running or test results not (yet) available Build failures during: - =3D unknown or N/A c =3D Configure, m =3D make, M =3D make (after miniperl), t =3D make test-p= rep 21949 Configuration (common) none ------------ ------------------------------------------------...

1.5.0.0.3 vs 1.5.0.0.4
I have had numerous difficulties with FF 1.5.0.0.4, in particular, some sites often just hang when I click on links. A particularly bad site is Dell http://www.dell.com/, which - when I try to configure a computer - gets all kinds of "waiting for dell" status bar messages. I tried it with a clean profile, to no avail. It works flawlessly with IE. I downloaded fresh copies of 1.5.0.3 and 1.5.0.4 with the intent of uninstalling the latter and then trying the former. *The uninstall process hung*. So I installed 1.5.0.3 on top of 1.5.0.4. The Dell site now works fl...

Smoke [5.8.1] 20722 FAIL(c) aix 5.1.0.0 (aix/1 cpu)
Automated smoke report for 5.8.1 patch 20722 on aix - 5.1.0.0 (aix/1 cpu) (hungary) using gcc-3.3.1 version 3.3.1 Report generated by Test::Smoke v1.17 O = OK F = Failure(s), extended report at the bottom ? = still running or test results not (yet) available Build failures during: - = unknown or N/A c = Configure, m = make, t = make test-prep 20722 Configuration (common) -Dcc=gcc-3.3.1 ------------ ---------------------------------------------------------------- O O O O -Duseithreads -Duse64bitint c c c c -Duseithreads -Duselongdouble O O O O -Du...

Smoke [5.8.4] 22871 FAIL(Fc) cygwin_nt-5.0 1.5.10(0.116/4/2) (x86/1 cpu)
Automated smoke report for 5.8.4 patch 22871 PC09: x86 Family 15 Model 1 Stepping 2, GenuineIntel (x86/1 cpu) on cygwin_nt-5.0 - 1.5.10(0.116/4/2) using gcc version 3.3.1 (cygming special) smoketime 9 hours 8 minutes (average 45 minutes 42 seconds) Summary: FAIL(Fc) O =3D OK F =3D Failure(s), extended report at the bottom X =3D Failure(s) under TEST but not under harness ? =3D still running or test results not (yet) available Build failures during: - =3D unknown or N/A c =3D Configure, m =3D make, M =3D make (after miniperl), t =3D make test-p= rep ...

Smoke [5.8.4] 22661 FAIL(Fc) cygwin_nt-5.0 1.5.9(0.112/4/2) (x86/1 cpu)
Automated smoke report for 5.8.4 patch 22661 PC09: Intel(R) Pentium(R) 4 CPU 1.70GHz(~1694 MHz) (x86/1 cpu) on cygwin_nt-5.0 - 1.5.9(0.112/4/2) using gcc version 3.3.1 (cygming special) smoketime 7 hours 34 minutes (average 37 minutes 53 seconds) Summary: FAIL(Fc) O =3D OK F =3D Failure(s), extended report at the bottom X =3D Failure(s) under TEST but not under harness ? =3D still running or test results not (yet) available Build failures during: - =3D unknown or N/A c =3D Configure, m =3D make, M =3D make (after miniperl), t =3D make test-p= rep ...

Smoke [5.8.4] 22705 FAIL(Fc) cygwin_nt-5.0 1.5.9(0.112/4/2) (x86/1 cpu)
Automated smoke report for 5.8.4 patch 22705 PC09: x86 Family 15 Model 1 Stepping 2, GenuineIntel (x86/1 cpu) on cygwin_nt-5.0 - 1.5.9(0.112/4/2) using gcc version 3.3.1 (cygming special) smoketime 8 hours 2 minutes (average 40 minutes 13 seconds) Summary: FAIL(Fc) O =3D OK F =3D Failure(s), extended report at the bottom X =3D Failure(s) under TEST but not under harness ? =3D still running or test results not (yet) available Build failures during: - =3D unknown or N/A c =3D Configure, m =3D make, M =3D make (after miniperl), t =3D make test-p= rep ...

superreview granted: [Bug 341583] Bump Thunderbird version to 1.5.0.5 : [Attachment 225643] 1.5.0.4 -> 1.5.0.5
David Baron <dbaron@mozilla.com> has granted superreview: Bug 341583: Bump Thunderbird version to 1.5.0.5 https://bugzilla.mozilla.org/show_bug.cgi?id=341583 Attachment 225643: 1.5.0.4 -> 1.5.0.5 https://bugzilla.mozilla.org/attachment.cgi?id=225643&action=edit ...

superreview granted: [Bug 341582] bump version numbers for 1.5.0.5 release : [Attachment 225641] 1.5.0.4 -> 1.5.0.5
David Baron <dbaron@mozilla.com> has granted superreview: Bug 341582: bump version numbers for 1.5.0.5 release https://bugzilla.mozilla.org/show_bug.cgi?id=341582 Attachment 225641: 1.5.0.4 -> 1.5.0.5 https://bugzilla.mozilla.org/attachment.cgi?id=225641&action=edit ...

DBD-Oracle-1.12 under cygwin with Oracle 8.1.5.0.0?
Hi, I try to compile DBD-Orcacle-1.12 under cygwin, (installed on Windows NT), but... I made libic.a, and put it into /usr/local/lib/ dir, I installed Oracle client products (Pro*C/C++, OCI version 8.1.5.0.0), but I can't compile it... Could anybody help me? Thanks a lot, and sorry for my poor english, Endre --------- screen capture start: --------------------- zelenae@ZELENAE ~/src/DBD-Oracle-1.12 $ export ORACLE_HOME="/cygdrive/e/Oracle815/" zelenae@ZELENAE ~/src/DBD-Oracle-1.12 $ perl Makefile.PL Using DBI 1.32 installed in /usr/lib/perl5/site_perl/5...

Upgrading from ASE (32-bit) 12.0.0.7 on Solaris 2.8 64-bit to ASE(64-bit) 12.5.1 on Solaris 64-bit
Hello all, We are planning to upgrade our ASE servers from a 32-bit ASE 12.0.0.7 to 64-bit ASE 12.5.1 on Solaris 8. Could you please give what are the steps to be taken care and how do I start with ( Do I have to first upgrade to 32-bit12.5.1 and then upgrade to 64-bit ASE 12.5.1, or directly upgrade from 32-bit 12.0.0.7 to 64-bit 12.5.1 ?). Could you also please point to some documentation (about upgrading 32-bit 12.0.0.7 to 64-bit 12.5.1). Thanks RK ...

SOS: Sync with Oracle 8.1.6.1.0 using 8.1.6.1.0 ODBC Driver
Help! If any customer has successfully replicated bi-directionally from ASA7 to Oracle 8i (8.1.6) using the Oracle 8.1.6 Oracle ODBC Driver, we would appreciate any insight you may have concerning the small number of steps involved in implementing replication. I may be contacted directly at (206) 933-4956. Martin Douglas Senior Data Architect e-Commerce Group Food Services of America Please always specify the version and MORE importantly the BUILD number of ASA you are using with each post. If you are having problems with this Oracle driver, some of our customers hav...

Web resources about - DBD::ODBC 0.43 tests failed under cygwin perl 5.8.0 DBI 1.30 on N T4 SP 6a MERANT 5 32 bit ODBC driver 0.52.00.00 - perl.dbi.users

Resources last updated: 11/24/2015 7:09:34 AM