Problems building minimo, No rule to make target libpipboot.a. please help

Dear all,

I'm new to porting mozilla. I've tried to cross compile minimo for an
arm's platform in scratchbox. I check out the minimo project in 1.8
branch on aug 29 and build all. I've modified the mozconfig to disable
crypto and patch the
xpcom/reflect/xptcall/src/md/unix/xptcstubs_arm.cpp, add
__attribute__((used));
When build minimo executable binary, there is an error message:

c++ -o nsStaticComponents.o -c -I../../dist/include/system_wrappers
-include ../../config/gcc_hidden.h -DMOZILLA_INTERNAL_API
-DOSTYPE=\"Linux2.6.15-1\" -DOSARCH=\"Linux\" -DBUILD_ID=0000000000
-D_BUILD_STATIC_BIN=1 -I. -I../../xpfe/browser/src/ -I../../config
-I../../dist/include/xpcom -I../../dist/include/browser
-I../../dist/include/history -I../../dist/include/appshell
-I../../dist/include/string -I../../dist/include/embed_base
-I../../dist/include/webbrwsr -I../../dist/include/webshell
-I../../dist/include/windowwatcher -I../../dist/include/profile
-I../../dist/include/necko -I../../dist/include/docshell
-I../../dist/include/dom -I../../dist/include/widget
-I../../dist/include/uriloader -I../../dist/include/shistory
-I../../dist/include/webbrowserpersist -I../../dist/include/gfx
-I../../dist/include/layout -I../../dist/include/content
-I../../dist/include/profdirserviceprovider -I../../dist/include/pref
-I../../dist/include/pipnss -I../../dist/include/pipboot
-I../../dist/include/intl -I../../dist/include/imglib2
-I../../dist/include/embedcomponents -I../../dist/include/appcomps
-I../../dist/include/phone -I../../dist/include/js
-I../../dist/include/imglib2 -I../../dist/include/toolkitcomps
-I../../dist/include/minimo -I../../dist/include
-I../../dist/include/nspr          -fno-rtti -fno-exceptions -Wall
-Wconversion -Wpointer-arith -Wcast-align -Woverloaded-virtual -Wsynth
-Wno-ctor-dtor-privacy -Wno-non-virtual-dtor -Wno-long-long -pedantic
-fshort-wchar -pthread -pipe  -DNDEBUG -DTRIMMED -ffunction-sections
-Os  -I/usr/include/gtk-2.0 -I/usr/lib/gtk-2.0/include
-I/usr/include/atk-1.0 -I/usr/include/cairo -I/usr/include/pango-1.0
-I/usr/include/glib-2.0 -I/usr/lib/glib-2.0/include
-DMOZILLA_CLIENT -include ../../mozilla-config.h
-Wp,-MD,.deps/nsStaticComponents.pp nsStaticComponents.cpp
gmake[4]: *** No rule to make target
`../../dist/lib/components/libpipboot.a', needed by `minimo'.  Stop.
gmake[4]: Leaving directory `/tmp/mozilla/minimo/base'
gmake[3]: *** [libs] Error 2
gmake[3]: Leaving directory `/tmp/mozilla/minimo'
gmake[2]: *** [tier_99] Error 2
gmake[2]: Leaving directory `/tmp/mozilla'
make[1]: *** [default] Error 2
make[1]: Leaving directory `/tmp/mozilla'
make: *** [build] Error 2

So I also use the same mozconfig without patch xptcstubs_arm.cpp in
x86, fedora core 5, but still the same error.

If I remove "--disable-crypto" in mozconfig for arm in scratchbox,
there will be another error that may caused by qemu:

cd Linux2.6_arm_glibc_PTH_OPT.OBJ ; sh
/tmp/mozilla/security/nss/cmd/shlibsign/./sign.sh /tmp/mozilla/dist \
/tmp/mozilla/security/nss/cmd/shlibsign/Linux2.6_arm_glibc_PTH_OPT.OBJ
Linux /tmp/mozilla/dist/lib \
/tmp/mozilla/dist/lib/libsoftokn3.so
/tmp/mozilla/security/nss/cmd/shlibsign/Linux2.6_arm_glibc_PTH_OPT.OBJ/shlibsign
-v -i /tmp/mozilla/dist/lib/libsoftokn3.so
qemu: Unsupported syscall: 240

Besides, if I remove "--disable-crypto" in x86, that can be compiled.
Minimo is available when in dist/bin, using "./run-mozilla.sh
../minimo", but TestGtkEmbed will cause a segfault.

I think the error when add "--disable-crypto" is a general error, but I
don't know the exact description to find the issue on mozilla buglist.
If possibe, please give me advice in this issue or point me.

Regards,

Eric Tsai

0
MD
8/29/2006 9:47:54 AM
mozilla.dev.builds 1761 articles. 0 followers. Post Follow

0 Replies
340 Views

Similar Articles

[PageSpeed] 21

Reply:

Similar Artilces:

Perl-5.8.6 or Perl-5.8.5 Install/Build process on AIX 5.3 Make problem make: 1254-002 Cannot find a rule to create target <command-line> from dependencies. Stop.
------=_NextPart_000_0001_01C90BEC.E9B8A770 Content-Type: multipart/related; boundary="----=_NextPart_001_0002_01C90BEC.E9B8A770" ------=_NextPart_001_0002_01C90BEC.E9B8A770 Content-Type: multipart/alternative; boundary="----=_NextPart_002_0003_01C90BEC.E9B8A770" ------=_NextPart_002_0003_01C90BEC.E9B8A770 Content-Type: text/plain; charset="us-ascii" Content-Transfer-Encoding: 7bit Hello all, I am trying to build perl-5.8.6.tar.gz DBI-1.50.tar.gz and DBD-Oracle-1.16.tar.gz on AIX 5.3.0.0 downloaded from cpan.org I am tryi...

Help make the build faster by porting make rules to the misc tier
We added a capability to the Firefox build system that will ultimately lead to speeding up the build and we need your help to realize its potential. Background ========== The Firefox build executes as a pipeline of stages called tiers. The tiers are currently export -> compile -> misc -> libs -> tools. The build system iterates the tiers and builds directories in those tiers. The export, compile, and misc tiers are mostly concurrent. If you execute with |make -j32| or more, they should saturate your cores. If you have access to a modern, multi-core machine, yo...

Help make the build faster by porting make rules to the misc tier
We added a capability to the Firefox build system that will ultimately lead to speeding up the build and we need your help to realize its potential. Background ========== The Firefox build executes as a pipeline of stages called tiers. The tiers are currently export -> compile -> misc -> libs -> tools. The build system iterates the tiers and builds directories in those tiers. The export, compile, and misc tiers are mostly concurrent. If you execute with |make -j32| or more, they should saturate your cores. If you have access to a modern, multi-core machine, yo...

Build Problem
Hi. I encounter a vary strange problem and I can't fix it. Originally my PFC application was designed using pb 6.0. After that we upgrade 6.0 to 6.5(444). But when I tried to replace old pbl by new one I got this problem : I can't create an executable. It's always the same error after compilation: Object: pfc_u_gr Event: pfc_u_gr::create (0008): Error C0124: Illegal expression on left side of assignment (0009): Error C0063: Invalid operand type for Dot operator: unsignedinteger (0010): Error C0063: Inv...

Build Error while building B2G for armani. Please Help Me
make: *** No rule to make target `out/target/product/armani/obj/STATIC_LIBRARIES/lib_driver_cmd_qcwcn_intermediates/export_includes', n eeded by `out/target/product/armani/obj/EXECUTABLES/hostapd_intermediates/import_includes'. Stop Manifest: https://github.com/b2g-armani/manifest/blob/master/armani.xml ...

VS Builds, and Builds, and Builds
Hello, Has anyone else had this problem?  After a while of developing, and I go to compile, VS takes forever to build and I have to end-task it.  It's definitely after I've been working for a while, then it finally has "had it" and just takes forever to build.  It's annoying as I know its not the machine (2.8 GHZ processor and 1GB RAM).  Has anyone else experienced this problem?  By the way, I do have SP1 installed. Also, after minimizing and switching around screens, when it does this, the building icon in the status bar doesn't show.  And, for more informati...

XML
ok. I think I've spent too much time trying to figure this one out. I know Ive seen it posted somewhere in ALL of these threads, but I can find it again. Anyways, Im trying to create a xml string to pass  to my LoadXml(). I do not want to write a file, so Im creating a string. The problem is that when creating a string, the encoding is set to UTF-16. This is what was causing an error initially. I found a way to create a MemoryString, XmlTextWriter and a StreamReader. This will allow me to write to a stream in UTF-8, all good. I get my string returned with slashes though like the followi...

building composite control problem , please help
I am running one of the example from tutorials on vs.net 2003 i got this error message ----------------------------------------------------------- Specified cast is not valid. Description: An unhandled exception occurred during the execution of the current web request. Please review the stack trace for more information about the error and where it originated in the code. Exception Details: System.InvalidCastException: Specified cast is not valid. Source Error: Line 11: Get Line 12: Dim ctrl As TextBox Line 13: ctrl = Controls(...

Problem building latest build
Had to perform a repair to my XE2 installation, just to repair the help system (fruitlessly, but not the point), and the wonderful installation system decided to re-install the antiquated Indy version delivered with XE2, because it doesn't value weekends much. So I downloaded the latest Indy10 build (5072), and get errors. First is that the "HdrIcmp.icmp_dun" referenced in IdRawBuildIcmpMask in IdRawFunctions does not find the "icmp_dun" field in TIdICMPHdr. Indeed, it isn't there. Checked the SVN and the Fulgan ZIP. Where can I find a working ZIP? ...

Latest dev build of 'AJAX Control Toolkit'
Good morning,Following a previous post:http://forums.asp.net/thread/1444162.aspx rbuckton mentioned a new 'CalendarExtender' that's going to be included in the next release of the AJAX Extensions.  I'd like to take a look at the hard work that's been put into it so far, so I downloaded the latest development build (Oct 31 6:38pm) from:http://www.codeplex.com/SourceControl/ListDownloadableCommits.aspx?ProjectName=AtlasControlToolkitI have opened the solution in VS 2005 and removed the source control bindings and tried to build.  The SampleWebSite and ToolkitTests...

Wa..Please help me...about build web control problem...
Sorry for my poor english , well , i try to write a web control , and i write a inner class(ItemPanel) in to the test control . In the test control, i have a property of StartIndex , and ChildItem . I can compile and put the control to vs2003 IDE toolbox , and then i drag and drop the test control into aspx page. well , i can write some ChildItem Tag into aspx (with html text mode) , and run it well. But, i got a strange problem, when drag and drop the test control into aspx page , and add some ChildItem Tags into the control. Well, i change to Design Mode, and type other num into the StartI...

No rule to make target `.project' when building fennec release
I'm building sources from http://hg.mozilla.org/releases/mozilla-release/ a= nd get the following error:=20 make[5]: *** No rule to make target `.project', needed by `/Users/yu/Docume= nts/projects/mozilla/Fennec/release/obj-arm-linux-androideabi/mobile/androi= d/geckoview_library/.project'. Stop My mozconfig looks like this: ac_add_options --with-android-ndk=3D"$HOME/Development/android-ndk-r8e"=20 ac_add_options --with-android-sdk=3D"$HOME/Development/sdk/platforms/andro= id-17"=20 ac_add_options --enable-application=3Dmobile/andr...

HELP PLEASE
<!doctype html public "-//w3c//dtd html 4.0 transitional//en"> <html> We have a VERY large PB application that we're attempting to migrate to PB 7.02.&nbsp; We've tried many different EBF levels, and are not able to successfully rebuild.&nbsp; We get through the regeneration phase of the build, but as soon as it attempts to begin writing, it fails.&nbsp; We're moving from PB 5.03 Windows 95 to PB 7.02&nbsp; on NT.&nbsp; It's been over a month now, and people are getting very frustrated.&nbsp; As I stated, we've tried man...

problems building DBD::Oracle 1.16 - help
PREAMBLE: This may be the wrong address to send this to, if so I appologize and hope some kind soul will help direct me to whom/where I can get some assistance. I don't subscribe to this list, so any responses (hold the flames please) should please be sent to (or cc'd to) me at: ghoti@ix.netcom.com And yes, I did read the README files - and I either missed what I'm looking for, or it isn't there. ENVIRONMENT: SunOS 5.9 Generic_117171-12 sun4u sparc SUNW,Sun-Fire-880 Oracle 9i (ORACLE_HOME=/opt/oracle/product/9.2...

Web resources about - Problems building minimo, No rule to make target libpipboot.a. please help - mozilla.dev.builds

Resources last updated: 12/28/2015 10:27:32 AM