Build Fails on cbindgen Error

Hi,

I'm trying to set up a development environment for Thunderbird for the firs=
t time and am following the instructions for a Windows machine at: https://=
developer.mozilla.org/en-US/docs/Mozilla/Developer_guide/Build_Instructions=
/Simple_Thunderbird_build

I've been searching everywhere I could think of for a solution to the below=
 error with no success and I'm not sure where to go from here.

Any suggestions?

Thank you,
Chris



$ ./mach build
 Config object not found by mach.
 0:24.82 Clobber not needed.
 0:24.89 Adding make options from f:\mozilla-source\mozconfig
    MOZ_OBJDIR=3Df:/mozilla-source/obj-i686-pc-mingw32
    OBJDIR=3Df:/mozilla-source/obj-i686-pc-mingw32
    FOUND_MOZCONFIG=3Df:/mozilla-source/mozconfig
    export FOUND_MOZCONFIG
 0:27.13 c:\mozilla-build\bin\mozmake.EXE -f client.mk -s configure
 0:27.91 cd f:/mozilla-source/obj-i686-pc-mingw32
 0:28.11 f:/mozilla-source/configure
 0:31.84 Creating Python environment
 1:35.19 New python executable in f:\mozilla-source\obj-i686-pc-mingw32\_vi=
rtualenvs\init\Scripts\python2.7.exe
 1:35.20 Not overwriting existing python script f:\mozilla-source\obj-i686-=
pc-mingw32\_virtualenvs\init\Scripts\python.exe (you must use f:\mozilla-so=
urce\obj-i686-pc-mingw32\_virtualenvs\init\Scripts\python2.7.exe)
 1:35.20 Installing setuptools, pip, wheel...done.
 1:38.69 f:\mozilla-source\python\mozbuild\mozbuild\virtualenv.py:410: User=
Warning: Hacking environment to allow binary Python extensions to build. Yo=
u can make this warning go away by installing Visual Studio 2008. You can d=
ownload the Express Edition installer from http://go.microsoft.com/?linkid=
=3D7729279
 1:38.70   warnings.warn('Hacking environment to allow binary Python '
 1:38.72 Reexecuting in the virtualenv
 1:42.14 Adding configure options from f:\mozilla-source\mozconfig
 1:42.26   --enable-application=3Dcomm/mail
 1:42.34   --enable-calendar
 1:42.37 checking for vcs source checkout... hg
 1:44.63 checking for a shell... C:/mozilla-build/msys/bin/sh.exe
 1:49.84 checking for host system type... i686-pc-mingw32
 1:49.84 checking for target system type... i686-pc-mingw32
 1:50.52 checking whether cross compiling... no
 1:52.30 checking for the target C compiler... C:/PROGRA~2/MICROS~2/2017/CO=
MMUN~1/VC/Tools/MSVC/1416~1.270/bin/HostX64/x86/cl.exe
 1:54.83 checking whether the target C compiler can be used... yes
 1:57.10 checking for Python 3... C:/mozilla-build//python3/python3.exe (3.=
6.5)
 1:57.11 checking for hg... c:/mozilla-build/python/Scripts/hg.exe
 1:58.79 checking for Mercurial version... 4.5.3
 1:59.56 checking for sparse checkout... no
 1:59.65 checking for pkg_config... not found
 1:59.69 checking for yasm... c:/mozilla-build/bin/yasm.exe
 2:00.17 checking yasm version... 1.3.0
 2:00.25 checking for nasm... not found
 2:00.34 checking the target C compiler version... 19.16.27025
 2:02.86 checking the target C compiler works... yes
 2:02.90 checking for the target C++ compiler... C:/PROGRA~2/MICROS~2/2017/=
COMMUN~1/VC/Tools/MSVC/1416~1.270/bin/HostX64/x86/cl.exe
 2:03.79 checking whether the target C++ compiler can be used... yes
 2:03.82 checking the target C++ compiler version... 19.16.27025
 2:04.63 checking the target C++ compiler works... yes
 2:04.63 checking for the host C compiler... C:/PROGRA~2/MICROS~2/2017/COMM=
UN~1/VC/Tools/MSVC/1416~1.270/bin/HostX64/x86/cl.exe
 2:05.01 checking whether the host C compiler can be used... yes
 2:05.08 checking the host C compiler version... 19.16.27025
 2:05.41 checking the host C compiler works... yes
 2:05.41 checking for the host C++ compiler... C:/PROGRA~2/MICROS~2/2017/CO=
MMUN~1/VC/Tools/MSVC/1416~1.270/bin/HostX64/x86/cl.exe
 2:05.68 checking whether the host C++ compiler can be used... yes
 2:05.69 checking the host C++ compiler version... 19.16.27025
 2:06.00 checking the host C++ compiler works... yes
 2:06.58 checking for 64-bit OS... no
 2:06.66 checking for llvm_profdata... not found
 2:14.45 checking for Windows SDK... 0x0a00 in 'C:\Program Files (x86)\Wind=
ows Kits\10\'
 2:14.59 checking for Universal CRT SDK... 10.0.17763.0 in 'C:\Program File=
s (x86)\Windows Kits\10\'
 2:14.61 checking for the Debug Interface Access SDK... C:\PROGRA~2\MICROS~=
2\2017\COMMUN~1\DIA SDK
 2:14.75 checking for mt... C:/PROGRA~2/WI3CF2~1/10/bin/100177~1.0/x64/mt.e=
xe
 2:15.35 checking whether MT is really Microsoft Manifest Tool... yes
 2:15.45 checking for linker... C:/PROGRA~2/MICROS~2/2017/COMMUN~1/VC/Tools=
/MSVC/1416~1.270/bin/HostX64/x86/link.exe
 2:15.57 checking for host_linker... C:/PROGRA~2/MICROS~2/2017/COMMUN~1/VC/=
Tools/MSVC/1416~1.270/bin/HostX64/x86/link.exe
 2:15.59 checking for makecab... c:/WINDOWS/System32/makecab.exe
 2:16.68 checking for the assembler... C:/PROGRA~2/MICROS~2/2017/COMMUN~1/V=
C/Tools/MSVC/1416~1.270/bin/HostX64/x86/ml.exe
 2:17.01 checking whether the C compiler supports -fsanitize=3Dfuzzer-no-li=
nk... yes
 2:17.12 checking for rc... C:/PROGRA~2/WI3CF2~1/10/bin/100177~1.0/x64/rc.e=
xe
 2:17.19 checking for ar... C:/PROGRA~2/MICROS~2/2017/COMMUN~1/VC/Tools/MSV=
C/1416~1.270/bin/HostX64/x86/lib.exe
 2:17.67 checking for stdint.h... yes
 2:18.42 checking for inttypes.h... yes
 2:19.36 checking for malloc.h... yes
 2:19.99 checking for alloca.h... no
 2:20.27 checking for perf_event_open system call... no
 2:21.21 checking for llvm-config... not found
 2:21.25 checking bindgen cflags... -x c++ -std=3Dgnu++14 -fno-sized-deallo=
cation -DTRACING=3D1 -DIMPL_LIBXUL -DMOZILLA_INTERNAL_API -DRUST_BINDGEN -D=
OS_WIN=3D1 -DWIN32=3D1
 2:21.34 checking for rustc... c:/Users/calindsey/.cargo/bin/rustc.exe
 2:21.42 checking for cargo... c:/Users/calindsey/.cargo/bin/cargo.exe
 2:33.06 checking rustc version... 1.31.1
 2:34.43 checking cargo version... 1.31.0
 2:46.95 checking for rustdoc... c:/Users/calindsey/.cargo/bin/rustdoc.exe
 2:47.00 checking for cbindgen... not found
 2:47.00 DEBUG: cbindgen: Trying cbindgen
 2:47.02 DEBUG: cbindgen: Trying c:/Users/calindsey/.cargo/bin/cbindgen
 2:47.02 ERROR: Cannot find cbindgen
 2:47.24 *** Fix above errors and then restart with\
 2:47.24                "./mach build"
 2:47.27 mozmake.EXE: *** [client.mk:115: configure] Error 1
0
Chris
12/30/2018 12:43:42 AM
mozilla.dev.builds 1728 articles. 0 followers. Post Follow

3 Replies
46 Views

Similar Articles

[PageSpeed] 22

--0000000000008bf33e057e32a755
Content-Type: text/plain; charset="UTF-8"

Try: cargo install cbindgen

On Sat, Dec 29, 2018, 16:45 <Chris@christopherlindsey.com wrote:

> Hi,
>
> I'm trying to set up a development environment for Thunderbird for the
> first time and am following the instructions for a Windows machine at:
> https://developer.mozilla.org/en-US/docs/Mozilla/Developer_guide/Build_Instructions/Simple_Thunderbird_build
>
> I've been searching everywhere I could think of for a solution to the
> below error with no success and I'm not sure where to go from here.
>
> Any suggestions?
>
> Thank you,
> Chris
>
>
>
> $ ./mach build
>  Config object not found by mach.
>  0:24.82 Clobber not needed.
>  0:24.89 Adding make options from f:\mozilla-source\mozconfig
>     MOZ_OBJDIR=f:/mozilla-source/obj-i686-pc-mingw32
>     OBJDIR=f:/mozilla-source/obj-i686-pc-mingw32
>     FOUND_MOZCONFIG=f:/mozilla-source/mozconfig
>     export FOUND_MOZCONFIG
>  0:27.13 c:\mozilla-build\bin\mozmake.EXE -f client.mk -s configure
>  0:27.91 cd f:/mozilla-source/obj-i686-pc-mingw32
>  0:28.11 f:/mozilla-source/configure
>  0:31.84 Creating Python environment
>  1:35.19 New python executable in
> f:\mozilla-source\obj-i686-pc-mingw32\_virtualenvs\init\Scripts\python2.7.exe
>  1:35.20 Not overwriting existing python script
> f:\mozilla-source\obj-i686-pc-mingw32\_virtualenvs\init\Scripts\python.exe
> (you must use
> f:\mozilla-source\obj-i686-pc-mingw32\_virtualenvs\init\Scripts\python2.7.exe)
>  1:35.20 Installing setuptools, pip, wheel...done.
>  1:38.69 f:\mozilla-source\python\mozbuild\mozbuild\virtualenv.py:410:
> UserWarning: Hacking environment to allow binary Python extensions to
> build. You can make this warning go away by installing Visual Studio 2008.
> You can download the Express Edition installer from
> http://go.microsoft.com/?linkid=7729279
>  1:38.70   warnings.warn('Hacking environment to allow binary Python '
>  1:38.72 Reexecuting in the virtualenv
>  1:42.14 Adding configure options from f:\mozilla-source\mozconfig
>  1:42.26   --enable-application=comm/mail
>  1:42.34   --enable-calendar
>  1:42.37 checking for vcs source checkout... hg
>  1:44.63 checking for a shell... C:/mozilla-build/msys/bin/sh.exe
>  1:49.84 checking for host system type... i686-pc-mingw32
>  1:49.84 checking for target system type... i686-pc-mingw32
>  1:50.52 checking whether cross compiling... no
>  1:52.30 checking for the target C compiler...
> C:/PROGRA~2/MICROS~2/2017/COMMUN~1/VC/Tools/MSVC/1416~1.270/bin/HostX64/x86/cl.exe
>  1:54.83 checking whether the target C compiler can be used... yes
>  1:57.10 checking for Python 3... C:/mozilla-build//python3/python3.exe
> (3.6.5)
>  1:57.11 checking for hg... c:/mozilla-build/python/Scripts/hg.exe
>  1:58.79 checking for Mercurial version... 4.5.3
>  1:59.56 checking for sparse checkout... no
>  1:59.65 checking for pkg_config... not found
>  1:59.69 checking for yasm... c:/mozilla-build/bin/yasm.exe
>  2:00.17 checking yasm version... 1.3.0
>  2:00.25 checking for nasm... not found
>  2:00.34 checking the target C compiler version... 19.16.27025
>  2:02.86 checking the target C compiler works... yes
>  2:02.90 checking for the target C++ compiler...
> C:/PROGRA~2/MICROS~2/2017/COMMUN~1/VC/Tools/MSVC/1416~1.270/bin/HostX64/x86/cl.exe
>  2:03.79 checking whether the target C++ compiler can be used... yes
>  2:03.82 checking the target C++ compiler version... 19.16.27025
>  2:04.63 checking the target C++ compiler works... yes
>  2:04.63 checking for the host C compiler...
> C:/PROGRA~2/MICROS~2/2017/COMMUN~1/VC/Tools/MSVC/1416~1.270/bin/HostX64/x86/cl.exe
>  2:05.01 checking whether the host C compiler can be used... yes
>  2:05.08 checking the host C compiler version... 19.16.27025
>  2:05.41 checking the host C compiler works... yes
>  2:05.41 checking for the host C++ compiler...
> C:/PROGRA~2/MICROS~2/2017/COMMUN~1/VC/Tools/MSVC/1416~1.270/bin/HostX64/x86/cl.exe
>  2:05.68 checking whether the host C++ compiler can be used... yes
>  2:05.69 checking the host C++ compiler version... 19.16.27025
>  2:06.00 checking the host C++ compiler works... yes
>  2:06.58 checking for 64-bit OS... no
>  2:06.66 checking for llvm_profdata... not found
>  2:14.45 checking for Windows SDK... 0x0a00 in 'C:\Program Files
> (x86)\Windows Kits\10\'
>  2:14.59 checking for Universal CRT SDK... 10.0.17763.0 in 'C:\Program
> Files (x86)\Windows Kits\10\'
>  2:14.61 checking for the Debug Interface Access SDK...
> C:\PROGRA~2\MICROS~2\2017\COMMUN~1\DIA SDK
>  2:14.75 checking for mt...
> C:/PROGRA~2/WI3CF2~1/10/bin/100177~1.0/x64/mt.exe
>  2:15.35 checking whether MT is really Microsoft Manifest Tool... yes
>  2:15.45 checking for linker...
> C:/PROGRA~2/MICROS~2/2017/COMMUN~1/VC/Tools/MSVC/1416~1.270/bin/HostX64/x86/link.exe
>  2:15.57 checking for host_linker...
> C:/PROGRA~2/MICROS~2/2017/COMMUN~1/VC/Tools/MSVC/1416~1.270/bin/HostX64/x86/link.exe
>  2:15.59 checking for makecab... c:/WINDOWS/System32/makecab.exe
>  2:16.68 checking for the assembler...
> C:/PROGRA~2/MICROS~2/2017/COMMUN~1/VC/Tools/MSVC/1416~1.270/bin/HostX64/x86/ml.exe
>  2:17.01 checking whether the C compiler supports
> -fsanitize=fuzzer-no-link... yes
>  2:17.12 checking for rc...
> C:/PROGRA~2/WI3CF2~1/10/bin/100177~1.0/x64/rc.exe
>  2:17.19 checking for ar...
> C:/PROGRA~2/MICROS~2/2017/COMMUN~1/VC/Tools/MSVC/1416~1.270/bin/HostX64/x86/lib.exe
>  2:17.67 checking for stdint.h... yes
>  2:18.42 checking for inttypes.h... yes
>  2:19.36 checking for malloc.h... yes
>  2:19.99 checking for alloca.h... no
>  2:20.27 checking for perf_event_open system call... no
>  2:21.21 checking for llvm-config... not found
>  2:21.25 checking bindgen cflags... -x c++ -std=gnu++14
> -fno-sized-deallocation -DTRACING=1 -DIMPL_LIBXUL -DMOZILLA_INTERNAL_API
> -DRUST_BINDGEN -DOS_WIN=1 -DWIN32=1
>  2:21.34 checking for rustc... c:/Users/calindsey/.cargo/bin/rustc.exe
>  2:21.42 checking for cargo... c:/Users/calindsey/.cargo/bin/cargo.exe
>  2:33.06 checking rustc version... 1.31.1
>  2:34.43 checking cargo version... 1.31.0
>  2:46.95 checking for rustdoc... c:/Users/calindsey/.cargo/bin/rustdoc.exe
>  2:47.00 checking for cbindgen... not found
>  2:47.00 DEBUG: cbindgen: Trying cbindgen
>  2:47.02 DEBUG: cbindgen: Trying c:/Users/calindsey/.cargo/bin/cbindgen
>  2:47.02 ERROR: Cannot find cbindgen
>  2:47.24 *** Fix above errors and then restart with\
>  2:47.24                "./mach build"
>  2:47.27 mozmake.EXE: *** [client.mk:115: configure] Error 1
> _______________________________________________
> dev-builds mailing list
> dev-builds@lists.mozilla.org
> https://lists.mozilla.org/listinfo/dev-builds
>

--0000000000008bf33e057e32a755
Content-Type: text/html; charset="UTF-8"
Content-Transfer-Encoding: quoted-printable

<div dir=3D"auto">Try: cargo install cbindgen</div><br><div class=3D"gmail_=
quote"><div dir=3D"ltr">On Sat, Dec 29, 2018, 16:45  &lt;<a href=3D"mailto:=
Chris@christopherlindsey.com">Chris@christopherlindsey.com</a> wrote:<br></=
div><blockquote class=3D"gmail_quote" style=3D"margin:0 0 0 .8ex;border-lef=
t:1px #ccc solid;padding-left:1ex">Hi,<br>
<br>
I&#39;m trying to set up a development environment for Thunderbird for the =
first time and am following the instructions for a Windows machine at: <a h=
ref=3D"https://developer.mozilla.org/en-US/docs/Mozilla/Developer_guide/Bui=
ld_Instructions/Simple_Thunderbird_build" rel=3D"noreferrer noreferrer" tar=
get=3D"_blank">https://developer.mozilla.org/en-US/docs/Mozilla/Developer_g=
uide/Build_Instructions/Simple_Thunderbird_build</a><br>
<br>
I&#39;ve been searching everywhere I could think of for a solution to the b=
elow error with no success and I&#39;m not sure where to go from here.<br>
<br>
Any suggestions?<br>
<br>
Thank you,<br>
Chris<br>
<br>
<br>
<br>
$ ./mach build<br>
=C2=A0Config object not found by mach.<br>
=C2=A00:24.82 Clobber not needed.<br>
=C2=A00:24.89 Adding make options from f:\mozilla-source\mozconfig<br>
=C2=A0 =C2=A0 MOZ_OBJDIR=3Df:/mozilla-source/obj-i686-pc-mingw32<br>
=C2=A0 =C2=A0 OBJDIR=3Df:/mozilla-source/obj-i686-pc-mingw32<br>
=C2=A0 =C2=A0 FOUND_MOZCONFIG=3Df:/mozilla-source/mozconfig<br>
=C2=A0 =C2=A0 export FOUND_MOZCONFIG<br>
=C2=A00:27.13 c:\mozilla-build\bin\mozmake.EXE -f <a href=3D"http://client.=
mk" rel=3D"noreferrer noreferrer" target=3D"_blank">client.mk</a> -s config=
ure<br>
=C2=A00:27.91 cd f:/mozilla-source/obj-i686-pc-mingw32<br>
=C2=A00:28.11 f:/mozilla-source/configure<br>
=C2=A00:31.84 Creating Python environment<br>
=C2=A01:35.19 New python executable in f:\mozilla-source\obj-i686-pc-mingw3=
2\_virtualenvs\init\Scripts\python2.7.exe<br>
=C2=A01:35.20 Not overwriting existing python script f:\mozilla-source\obj-=
i686-pc-mingw32\_virtualenvs\init\Scripts\python.exe (you must use f:\mozil=
la-source\obj-i686-pc-mingw32\_virtualenvs\init\Scripts\python2.7.exe)<br>
=C2=A01:35.20 Installing setuptools, pip, wheel...done.<br>
=C2=A01:38.69 f:\mozilla-source\python\mozbuild\mozbuild\virtualenv.py:410:=
 UserWarning: Hacking environment to allow binary Python extensions to buil=
d. You can make this warning go away by installing Visual Studio 2008. You =
can download the Express Edition installer from <a href=3D"http://go.micros=
oft.com/?linkid=3D7729279" rel=3D"noreferrer noreferrer" target=3D"_blank">=
http://go.microsoft.com/?linkid=3D7729279</a><br>
=C2=A01:38.70=C2=A0 =C2=A0warnings.warn(&#39;Hacking environment to allow b=
inary Python &#39;<br>
=C2=A01:38.72 Reexecuting in the virtualenv<br>
=C2=A01:42.14 Adding configure options from f:\mozilla-source\mozconfig<br>
=C2=A01:42.26=C2=A0 =C2=A0--enable-application=3Dcomm/mail<br>
=C2=A01:42.34=C2=A0 =C2=A0--enable-calendar<br>
=C2=A01:42.37 checking for vcs source checkout... hg<br>
=C2=A01:44.63 checking for a shell... C:/mozilla-build/msys/bin/sh.exe<br>
=C2=A01:49.84 checking for host system type... i686-pc-mingw32<br>
=C2=A01:49.84 checking for target system type... i686-pc-mingw32<br>
=C2=A01:50.52 checking whether cross compiling... no<br>
=C2=A01:52.30 checking for the target C compiler... C:/PROGRA~2/MICROS~2/20=
17/COMMUN~1/VC/Tools/MSVC/1416~1.270/bin/HostX64/x86/cl.exe<br>
=C2=A01:54.83 checking whether the target C compiler can be used... yes<br>
=C2=A01:57.10 checking for Python 3... C:/mozilla-build//python3/python3.ex=
e (3.6.5)<br>
=C2=A01:57.11 checking for hg... c:/mozilla-build/python/Scripts/hg.exe<br>
=C2=A01:58.79 checking for Mercurial version... 4.5.3<br>
=C2=A01:59.56 checking for sparse checkout... no<br>
=C2=A01:59.65 checking for pkg_config... not found<br>
=C2=A01:59.69 checking for yasm... c:/mozilla-build/bin/yasm.exe<br>
=C2=A02:00.17 checking yasm version... 1.3.0<br>
=C2=A02:00.25 checking for nasm... not found<br>
=C2=A02:00.34 checking the target C compiler version... 19.16.27025<br>
=C2=A02:02.86 checking the target C compiler works... yes<br>
=C2=A02:02.90 checking for the target C++ compiler... C:/PROGRA~2/MICROS~2/=
2017/COMMUN~1/VC/Tools/MSVC/1416~1.270/bin/HostX64/x86/cl.exe<br>
=C2=A02:03.79 checking whether the target C++ compiler can be used... yes<b=
r>
=C2=A02:03.82 checking the target C++ compiler version... 19.16.27025<br>
=C2=A02:04.63 checking the target C++ compiler works... yes<br>
=C2=A02:04.63 checking for the host C compiler... C:/PROGRA~2/MICROS~2/2017=
/COMMUN~1/VC/Tools/MSVC/1416~1.270/bin/HostX64/x86/cl.exe<br>
=C2=A02:05.01 checking whether the host C compiler can be used... yes<br>
=C2=A02:05.08 checking the host C compiler version... 19.16.27025<br>
=C2=A02:05.41 checking the host C compiler works... yes<br>
=C2=A02:05.41 checking for the host C++ compiler... C:/PROGRA~2/MICROS~2/20=
17/COMMUN~1/VC/Tools/MSVC/1416~1.270/bin/HostX64/x86/cl.exe<br>
=C2=A02:05.68 checking whether the host C++ compiler can be used... yes<br>
=C2=A02:05.69 checking the host C++ compiler version... 19.16.27025<br>
=C2=A02:06.00 checking the host C++ compiler works... yes<br>
=C2=A02:06.58 checking for 64-bit OS... no<br>
=C2=A02:06.66 checking for llvm_profdata... not found<br>
=C2=A02:14.45 checking for Windows SDK... 0x0a00 in &#39;C:\Program Files (=
x86)\Windows Kits\10\&#39;<br>
=C2=A02:14.59 checking for Universal CRT SDK... 10.0.17763.0 in &#39;C:\Pro=
gram Files (x86)\Windows Kits\10\&#39;<br>
=C2=A02:14.61 checking for the Debug Interface Access SDK... C:\PROGRA~2\MI=
CROS~2\2017\COMMUN~1\DIA SDK<br>
=C2=A02:14.75 checking for mt... C:/PROGRA~2/WI3CF2~1/10/bin/100177~1.0/x64=
/mt.exe<br>
=C2=A02:15.35 checking whether MT is really Microsoft Manifest Tool... yes<=
br>
=C2=A02:15.45 checking for linker... C:/PROGRA~2/MICROS~2/2017/COMMUN~1/VC/=
Tools/MSVC/1416~1.270/bin/HostX64/x86/link.exe<br>
=C2=A02:15.57 checking for host_linker... C:/PROGRA~2/MICROS~2/2017/COMMUN~=
1/VC/Tools/MSVC/1416~1.270/bin/HostX64/x86/link.exe<br>
=C2=A02:15.59 checking for makecab... c:/WINDOWS/System32/makecab.exe<br>
=C2=A02:16.68 checking for the assembler... C:/PROGRA~2/MICROS~2/2017/COMMU=
N~1/VC/Tools/MSVC/1416~1.270/bin/HostX64/x86/ml.exe<br>
=C2=A02:17.01 checking whether the C compiler supports -fsanitize=3Dfuzzer-=
no-link... yes<br>
=C2=A02:17.12 checking for rc... C:/PROGRA~2/WI3CF2~1/10/bin/100177~1.0/x64=
/rc.exe<br>
=C2=A02:17.19 checking for ar... C:/PROGRA~2/MICROS~2/2017/COMMUN~1/VC/Tool=
s/MSVC/1416~1.270/bin/HostX64/x86/lib.exe<br>
=C2=A02:17.67 checking for stdint.h... yes<br>
=C2=A02:18.42 checking for inttypes.h... yes<br>
=C2=A02:19.36 checking for malloc.h... yes<br>
=C2=A02:19.99 checking for alloca.h... no<br>
=C2=A02:20.27 checking for perf_event_open system call... no<br>
=C2=A02:21.21 checking for llvm-config... not found<br>
=C2=A02:21.25 checking bindgen cflags... -x c++ -std=3Dgnu++14 -fno-sized-d=
eallocation -DTRACING=3D1 -DIMPL_LIBXUL -DMOZILLA_INTERNAL_API -DRUST_BINDG=
EN -DOS_WIN=3D1 -DWIN32=3D1<br>
=C2=A02:21.34 checking for rustc... c:/Users/calindsey/.cargo/bin/rustc.exe=
<br>
=C2=A02:21.42 checking for cargo... c:/Users/calindsey/.cargo/bin/cargo.exe=
<br>
=C2=A02:33.06 checking rustc version... 1.31.1<br>
=C2=A02:34.43 checking cargo version... 1.31.0<br>
=C2=A02:46.95 checking for rustdoc... c:/Users/calindsey/.cargo/bin/rustdoc=
..exe<br>
=C2=A02:47.00 checking for cbindgen... not found<br>
=C2=A02:47.00 DEBUG: cbindgen: Trying cbindgen<br>
=C2=A02:47.02 DEBUG: cbindgen: Trying c:/Users/calindsey/.cargo/bin/cbindge=
n<br>
=C2=A02:47.02 ERROR: Cannot find cbindgen<br>
=C2=A02:47.24 *** Fix above errors and then restart with\<br>
=C2=A02:47.24=C2=A0 =C2=A0 =C2=A0 =C2=A0 =C2=A0 =C2=A0 =C2=A0 =C2=A0 &quot;=
../mach build&quot;<br>
=C2=A02:47.27 mozmake.EXE: *** [<a href=3D"http://client.mk:115" rel=3D"nor=
eferrer noreferrer" target=3D"_blank">client.mk:115</a>: configure] Error 1=
<br>
_______________________________________________<br>
dev-builds mailing list<br>
<a href=3D"mailto:dev-builds@lists.mozilla.org" target=3D"_blank" rel=3D"no=
referrer">dev-builds@lists.mozilla.org</a><br>
<a href=3D"https://lists.mozilla.org/listinfo/dev-builds" rel=3D"noreferrer=
 noreferrer" target=3D"_blank">https://lists.mozilla.org/listinfo/dev-build=
s</a><br>
</blockquote></div>

--0000000000008bf33e057e32a755--
0
Bobby
12/30/2018 12:48:15 AM
On Saturday, December 29, 2018 at 5:43:43 PM UTC-7, ch...@christopherlindse=
y.com wrote:
> Hi,
>=20
> I'm trying to set up a development environment for Thunderbird for the fi=
rst time and am following the instructions for a Windows machine at: https:=
//developer.mozilla.org/en-US/docs/Mozilla/Developer_guide/Build_Instructio=
ns/Simple_Thunderbird_build
>=20
> I've been searching everywhere I could think of for a solution to the bel=
ow error with no success and I'm not sure where to go from here.
>=20
> Any suggestions?
>=20
> Thank you,
> Chris
>=20
>=20
>=20
> $ ./mach build
>  Config object not found by mach.
>  0:24.82 Clobber not needed.
>  0:24.89 Adding make options from f:\mozilla-source\mozconfig
>     MOZ_OBJDIR=3Df:/mozilla-source/obj-i686-pc-mingw32
>     OBJDIR=3Df:/mozilla-source/obj-i686-pc-mingw32
>     FOUND_MOZCONFIG=3Df:/mozilla-source/mozconfig
>     export FOUND_MOZCONFIG
>  0:27.13 c:\mozilla-build\bin\mozmake.EXE -f client.mk -s configure
>  0:27.91 cd f:/mozilla-source/obj-i686-pc-mingw32
>  0:28.11 f:/mozilla-source/configure
>  0:31.84 Creating Python environment
>  1:35.19 New python executable in f:\mozilla-source\obj-i686-pc-mingw32\_=
virtualenvs\init\Scripts\python2.7.exe
>  1:35.20 Not overwriting existing python script f:\mozilla-source\obj-i68=
6-pc-mingw32\_virtualenvs\init\Scripts\python.exe (you must use f:\mozilla-=
source\obj-i686-pc-mingw32\_virtualenvs\init\Scripts\python2.7.exe)
>  1:35.20 Installing setuptools, pip, wheel...done.
>  1:38.69 f:\mozilla-source\python\mozbuild\mozbuild\virtualenv.py:410: Us=
erWarning: Hacking environment to allow binary Python extensions to build. =
You can make this warning go away by installing Visual Studio 2008. You can=
 download the Express Edition installer from http://go.microsoft.com/?linki=
d=3D7729279
>  1:38.70   warnings.warn('Hacking environment to allow binary Python '
>  1:38.72 Reexecuting in the virtualenv
>  1:42.14 Adding configure options from f:\mozilla-source\mozconfig
>  1:42.26   --enable-application=3Dcomm/mail
>  1:42.34   --enable-calendar
>  1:42.37 checking for vcs source checkout... hg
>  1:44.63 checking for a shell... C:/mozilla-build/msys/bin/sh.exe
>  1:49.84 checking for host system type... i686-pc-mingw32
>  1:49.84 checking for target system type... i686-pc-mingw32
>  1:50.52 checking whether cross compiling... no
>  1:52.30 checking for the target C compiler... C:/PROGRA~2/MICROS~2/2017/=
COMMUN~1/VC/Tools/MSVC/1416~1.270/bin/HostX64/x86/cl.exe
>  1:54.83 checking whether the target C compiler can be used... yes
>  1:57.10 checking for Python 3... C:/mozilla-build//python3/python3.exe (=
3.6.5)
>  1:57.11 checking for hg... c:/mozilla-build/python/Scripts/hg.exe
>  1:58.79 checking for Mercurial version... 4.5.3
>  1:59.56 checking for sparse checkout... no
>  1:59.65 checking for pkg_config... not found
>  1:59.69 checking for yasm... c:/mozilla-build/bin/yasm.exe
>  2:00.17 checking yasm version... 1.3.0
>  2:00.25 checking for nasm... not found
>  2:00.34 checking the target C compiler version... 19.16.27025
>  2:02.86 checking the target C compiler works... yes
>  2:02.90 checking for the target C++ compiler... C:/PROGRA~2/MICROS~2/201=
7/COMMUN~1/VC/Tools/MSVC/1416~1.270/bin/HostX64/x86/cl.exe
>  2:03.79 checking whether the target C++ compiler can be used... yes
>  2:03.82 checking the target C++ compiler version... 19.16.27025
>  2:04.63 checking the target C++ compiler works... yes
>  2:04.63 checking for the host C compiler... C:/PROGRA~2/MICROS~2/2017/CO=
MMUN~1/VC/Tools/MSVC/1416~1.270/bin/HostX64/x86/cl.exe
>  2:05.01 checking whether the host C compiler can be used... yes
>  2:05.08 checking the host C compiler version... 19.16.27025
>  2:05.41 checking the host C compiler works... yes
>  2:05.41 checking for the host C++ compiler... C:/PROGRA~2/MICROS~2/2017/=
COMMUN~1/VC/Tools/MSVC/1416~1.270/bin/HostX64/x86/cl.exe
>  2:05.68 checking whether the host C++ compiler can be used... yes
>  2:05.69 checking the host C++ compiler version... 19.16.27025
>  2:06.00 checking the host C++ compiler works... yes
>  2:06.58 checking for 64-bit OS... no
>  2:06.66 checking for llvm_profdata... not found
>  2:14.45 checking for Windows SDK... 0x0a00 in 'C:\Program Files (x86)\Wi=
ndows Kits\10\'
>  2:14.59 checking for Universal CRT SDK... 10.0.17763.0 in 'C:\Program Fi=
les (x86)\Windows Kits\10\'
>  2:14.61 checking for the Debug Interface Access SDK... C:\PROGRA~2\MICRO=
S~2\2017\COMMUN~1\DIA SDK
>  2:14.75 checking for mt... C:/PROGRA~2/WI3CF2~1/10/bin/100177~1.0/x64/mt=
..exe
>  2:15.35 checking whether MT is really Microsoft Manifest Tool... yes
>  2:15.45 checking for linker... C:/PROGRA~2/MICROS~2/2017/COMMUN~1/VC/Too=
ls/MSVC/1416~1.270/bin/HostX64/x86/link.exe
>  2:15.57 checking for host_linker... C:/PROGRA~2/MICROS~2/2017/COMMUN~1/V=
C/Tools/MSVC/1416~1.270/bin/HostX64/x86/link.exe
>  2:15.59 checking for makecab... c:/WINDOWS/System32/makecab.exe
>  2:16.68 checking for the assembler... C:/PROGRA~2/MICROS~2/2017/COMMUN~1=
/VC/Tools/MSVC/1416~1.270/bin/HostX64/x86/ml.exe
>  2:17.01 checking whether the C compiler supports -fsanitize=3Dfuzzer-no-=
link... yes
>  2:17.12 checking for rc... C:/PROGRA~2/WI3CF2~1/10/bin/100177~1.0/x64/rc=
..exe
>  2:17.19 checking for ar... C:/PROGRA~2/MICROS~2/2017/COMMUN~1/VC/Tools/M=
SVC/1416~1.270/bin/HostX64/x86/lib.exe
>  2:17.67 checking for stdint.h... yes
>  2:18.42 checking for inttypes.h... yes
>  2:19.36 checking for malloc.h... yes
>  2:19.99 checking for alloca.h... no
>  2:20.27 checking for perf_event_open system call... no
>  2:21.21 checking for llvm-config... not found
>  2:21.25 checking bindgen cflags... -x c++ -std=3Dgnu++14 -fno-sized-deal=
location -DTRACING=3D1 -DIMPL_LIBXUL -DMOZILLA_INTERNAL_API -DRUST_BINDGEN =
-DOS_WIN=3D1 -DWIN32=3D1
>  2:21.34 checking for rustc... c:/Users/calindsey/.cargo/bin/rustc.exe
>  2:21.42 checking for cargo... c:/Users/calindsey/.cargo/bin/cargo.exe
>  2:33.06 checking rustc version... 1.31.1
>  2:34.43 checking cargo version... 1.31.0
>  2:46.95 checking for rustdoc... c:/Users/calindsey/.cargo/bin/rustdoc.ex=
e
>  2:47.00 checking for cbindgen... not found
>  2:47.00 DEBUG: cbindgen: Trying cbindgen
>  2:47.02 DEBUG: cbindgen: Trying c:/Users/calindsey/.cargo/bin/cbindgen
>  2:47.02 ERROR: Cannot find cbindgen
>  2:47.24 *** Fix above errors and then restart with\
>  2:47.24                "./mach build"
>  2:47.27 mozmake.EXE: *** [client.mk:115: configure] Error 1


Hi,

Thanks Bobby!  That helped get me through the previous error.  But, I still=
 can't get a successful build.  Below are the results of the latest attempt=
..

I obviously don't want to have to ask for help on every build error.  Where=
 would be the best place for me to go to lookup what these errors are and h=
ow to resolve them?

But, if it's something obvious in my configuration, feel free to point it o=
ut.

Thanks,
Chris

 0:30.34 Clobber not needed.
 0:30.38 Adding make options from f:\mozilla-source\mozconfig
    MOZ_OBJDIR=3Df:/mozilla-source/obj-i686-pc-mingw32
    OBJDIR=3Df:/mozilla-source/obj-i686-pc-mingw32
    FOUND_MOZCONFIG=3Df:/mozilla-source/mozconfig
    export FOUND_MOZCONFIG
 0:31.80 c:\mozilla-build\bin\mozmake.EXE -f client.mk -s
 1:29.87 Elapsed: 0.02s; From dist/public: Kept 0 existing; Added/updated 0=
; Removed 0 files and 0 directories.
 1:31.34 Elapsed: 0.02s; From dist/private: Kept 0 existing; Added/updated =
0; Removed 0 files and 0 directories.
 1:34.36 Elapsed: 1.77s; From dist/xpi-stage: Kept 76 existing; Added/updat=
ed 0; Removed 0 files and 0 directories.
 1:54.68 Elapsed: 19.00s; From _tests: Kept 0 existing; Added/updated 1478;=
 Removed 0 files and 0 directories.
 2:16.72 Elapsed: 19.56s; From dist/bin: Kept 0 existing; Added/updated 254=
3; Removed 0 files and 0 directories.
 2:27.09 Elapsed: 57.20s; From dist/include: Kept 0 existing; Added/updated=
 6032; Removed 0 files and 0 directories.
 3:33.79 js/src/rust/force-cargo-library-build
 3:33.87 toolkit/library/rust/force-cargo-library-build
 4:01.74     Blocking waiting for file lock on build directory
 4:21.59    Compiling mozurl v0.0.1 (F:\mozilla-source\netwerk\base\mozurl)
 4:29.81    Compiling baldrdash v0.1.0 (F:\mozilla-source\js\src\wasm\crane=
lift)
 4:30.33     Blocking waiting for file lock on build directory
 4:30.37 error: failed to run custom build command for `baldrdash v0.1.0 (F=
:\mozilla-source\js\src\wasm\cranelift)`
 4:30.37 process didn't exit successfully: `f:/mozilla-source/obj-i686-pc-m=
ingw32\release\build\baldrdash-38f50de767197ce4\build-script-build` (exit c=
ode: 101)
 4:30.37 --- stdout
 4:30.37 cargo:rerun-if-changed=3Dbaldrapi.h
 4:30.37 cargo:rerun-if-changed=3Df:/mozilla-source/obj-i686-pc-mingw32\js/=
src/rust/extra-bindgen-flags
 4:30.37 --- stderr
 4:30.37 thread 'main' panicked at 'Unable to find libclang: "couldn\'t fin=
d any valid shared libraries matching: [\'clang.dll\', \'libclang.dll\'], s=
et the `LIBCLANG_PATH` environment variable to a path where one of these fi=
les can be found (invalid: [])"', libcore\result.rs:1009:5
 4:30.37 stack backtrace:
 4:30.37    0:     0x7ffc719d3ed2 - <std::sync::mpsc::select::Select as cor=
e::fmt::Debug>::fmt::h3779cdf6deab4fb2
 4:30.37    1:     0x7ffc719bed7f - std::path::<impl core::convert::From<st=
d::path::PathBuf> for std::ffi::os_str::OsString>::from::hef69882d0aae8fb6
 4:30.37    2:     0x7ffc719b9038 - std::panicking::take_hook::h28cd6f8e37a=
0a07d
 4:30.37    3:     0x7ffc719b8cf1 - std::panicking::take_hook::h28cd6f8e37a=
0a07d
 4:30.37    4:     0x7ffc719b989c - std::panicking::rust_panic_with_hook::h=
83c643dba7ec424c
 4:30.37    5:     0x7ffc719b93c3 - std::panicking::begin_panic_fmt::hdc3de=
53d5c0ccc24
 4:30.37    6:     0x7ffc719b92a8 - rust_begin_unwind
 4:30.37    7:     0x7ffc719edbdb - core::panicking::panic_fmt::ha79ca86aa4=
b70ade
 4:30.37    8:     0x7ff6e10a80c6 - <&T as core::convert::AsRef<U>>::as_ref=
::h703ff844f1016e01
 4:30.37    9:     0x7ff6e109a182 - <&T as core::convert::AsRef<U>>::as_ref=
::h703ff844f1016e01
 4:30.37   10:     0x7ffc719dfc18 - std::sync::once::Once::call_inner::h314=
cd51909d142ef
 4:30.37   11:     0x7ff6e116d51d - bindgen::Builder::generate::h657cfddd49=
4ecf1a
 4:30.37   12:     0x7ff6e1097776 - core::alloc::size_align::h9cf92d476a11d=
e20
 4:30.37   13:     0x7ff6e1091f85 - std::rt::lang_start::h4fba4b55d34bb956
 4:30.37   14:     0x7ffc719b9206 - std::panicking::update_panic_count::hf9=
e0b184b1baf22b
 4:30.37   15:     0x7ffc719eaa61 - _rust_maybe_catch_panic
 4:30.37   16:     0x7ffc719c8a82 - std::rt::lang_start_internal::h8f028255=
e9554163
 4:30.39   17:     0x7ff6e1091f72 - std::rt::lang_start::h4fba4b55d34bb956
 4:30.39   18:     0x7ff6e123ee13 - invoke_main
 4:30.39                                at d:\agent\_work\3\s\src\vctools\c=
rt\vcstartup\src\startup\exe_common.inl:78
 4:30.39   19:     0x7ff6e123ee13 - invoke_main
 4:30.39                                at d:\agent\_work\3\s\src\vctools\c=
rt\vcstartup\src\startup\exe_common.inl:78
 4:30.39   20:     0x7ffca1163033 - BaseThreadInitThunk
 4:30.39   21:     0x7ffca3a53690 - RtlUserThreadStart
 4:30.81 mozmake.EXE[4]: *** [f:/mozilla-source/config/rules.mk:1040: force=
-cargo-library-build] Error 101
 4:30.84 mozmake.EXE[3]: *** [f:/mozilla-source/config/recurse.mk:74: toolk=
it/library/rust/target] Error 2
 4:30.84 mozmake.EXE[3]: *** Waiting for unfinished jobs....
 4:31.34    Compiling baldrdash v0.1.0 (F:\mozilla-source\js\src\wasm\crane=
lift)
 4:31.34    Compiling target-lexicon v0.2.0
 4:31.83 error: failed to run custom build command for `baldrdash v0.1.0 (F=
:\mozilla-source\js\src\wasm\cranelift)`
 4:31.83 process didn't exit successfully: `f:/mozilla-source/obj-i686-pc-m=
ingw32\release\build\baldrdash-38f50de767197ce4\build-script-build` (exit c=
ode: 101)
 4:31.83 --- stdout
 4:31.83 cargo:rerun-if-changed=3Dbaldrapi.h
 4:31.83 cargo:rerun-if-changed=3Df:/mozilla-source/obj-i686-pc-mingw32\js/=
src/rust/extra-bindgen-flags
 4:31.83 --- stderr
 4:31.83 thread 'main' panicked at 'Unable to find libclang: "couldn\'t fin=
d any valid shared libraries matching: [\'clang.dll\', \'libclang.dll\'], s=
et the `LIBCLANG_PATH` environment variable to a path where one of these fi=
les can be found (invalid: [])"', libcore\result.rs:1009:5
 4:31.83 stack backtrace:
 4:31.83    0:     0x7ffc719d3ed2 - <std::sync::mpsc::select::Select as cor=
e::fmt::Debug>::fmt::h3779cdf6deab4fb2
 4:31.83    1:     0x7ffc719bed7f - std::path::<impl core::convert::From<st=
d::path::PathBuf> for std::ffi::os_str::OsString>::from::hef69882d0aae8fb6
 4:31.83    2:     0x7ffc719b9038 - std::panicking::take_hook::h28cd6f8e37a=
0a07d
 4:31.83    3:     0x7ffc719b8cf1 - std::panicking::take_hook::h28cd6f8e37a=
0a07d
 4:31.83    4:     0x7ffc719b989c - std::panicking::rust_panic_with_hook::h=
83c643dba7ec424c
 4:31.83    5:     0x7ffc719b93c3 - std::panicking::begin_panic_fmt::hdc3de=
53d5c0ccc24
 4:31.83    6:     0x7ffc719b92a8 - rust_begin_unwind
 4:31.83    7:     0x7ffc719edbdb - core::panicking::panic_fmt::ha79ca86aa4=
b70ade
 4:31.83    8:     0x7ff6e10a80c6 - <&T as core::convert::AsRef<U>>::as_ref=
::h703ff844f1016e01
 4:31.83    9:     0x7ff6e109a182 - <&T as core::convert::AsRef<U>>::as_ref=
::h703ff844f1016e01
 4:31.83   10:     0x7ffc719dfc18 - std::sync::once::Once::call_inner::h314=
cd51909d142ef
 4:31.83   11:     0x7ff6e116d51d - bindgen::Builder::generate::h657cfddd49=
4ecf1a
 4:31.83   12:     0x7ff6e1097776 - core::alloc::size_align::h9cf92d476a11d=
e20
 4:31.84   13:     0x7ff6e1091f85 - std::rt::lang_start::h4fba4b55d34bb956
 4:31.84   14:     0x7ffc719b9206 - std::panicking::update_panic_count::hf9=
e0b184b1baf22b
 4:31.84   15:     0x7ffc719eaa61 - _rust_maybe_catch_panic
 4:31.84   16:     0x7ffc719c8a82 - std::rt::lang_start_internal::h8f028255=
e9554163
 4:31.84   17:     0x7ff6e1091f72 - std::rt::lang_start::h4fba4b55d34bb956
 4:31.84   18:     0x7ff6e123ee13 - invoke_main
 4:31.84                                at d:\agent\_work\3\s\src\vctools\c=
rt\vcstartup\src\startup\exe_common.inl:78
 4:31.84   19:     0x7ff6e123ee13 - invoke_main
 4:31.84                                at d:\agent\_work\3\s\src\vctools\c=
rt\vcstartup\src\startup\exe_common.inl:78
 4:31.84   20:     0x7ffca1163033 - BaseThreadInitThunk
 4:31.84   21:     0x7ffca3a53690 - RtlUserThreadStart
 4:31.84 warning: build failed, waiting for other jobs to finish...
 4:31.95 error: build failed
 4:32.06 mozmake.EXE[4]: *** [f:/mozilla-source/config/rules.mk:1040: force=
-cargo-library-build] Error 101
 4:32.06 mozmake.EXE[3]: *** [f:/mozilla-source/config/recurse.mk:74: js/sr=
c/rust/target] Error 2
 4:32.08 mozmake.EXE[2]: *** [f:/mozilla-source/config/recurse.mk:34: compi=
le] Error 2
 4:32.09 mozmake.EXE[1]: *** [f:/mozilla-source/config/rules.mk:424: defaul=
t] Error 2
 4:32.12 mozmake.EXE: *** [client.mk:125: build] Error 2
 4:32.19 0 compiler warnings present.
0
Chris
12/30/2018 6:04:49 AM
--000000000000b1642d057e40d952
Content-Type: text/plain; charset="UTF-8"

Try: ./mach bootstrap

On Sat, Dec 29, 2018, 22:05 <Chris@christopherlindsey.com wrote:

> On Saturday, December 29, 2018 at 5:43:43 PM UTC-7,
> ch...@christopherlindsey.com wrote:
> > Hi,
> >
> > I'm trying to set up a development environment for Thunderbird for the
> first time and am following the instructions for a Windows machine at:
> https://developer.mozilla.org/en-US/docs/Mozilla/Developer_guide/Build_Instructions/Simple_Thunderbird_build
> >
> > I've been searching everywhere I could think of for a solution to the
> below error with no success and I'm not sure where to go from here.
> >
> > Any suggestions?
> >
> > Thank you,
> > Chris
> >
> >
> >
> > $ ./mach build
> >  Config object not found by mach.
> >  0:24.82 Clobber not needed.
> >  0:24.89 Adding make options from f:\mozilla-source\mozconfig
> >     MOZ_OBJDIR=f:/mozilla-source/obj-i686-pc-mingw32
> >     OBJDIR=f:/mozilla-source/obj-i686-pc-mingw32
> >     FOUND_MOZCONFIG=f:/mozilla-source/mozconfig
> >     export FOUND_MOZCONFIG
> >  0:27.13 c:\mozilla-build\bin\mozmake.EXE -f client.mk -s configure
> >  0:27.91 cd f:/mozilla-source/obj-i686-pc-mingw32
> >  0:28.11 f:/mozilla-source/configure
> >  0:31.84 Creating Python environment
> >  1:35.19 New python executable in
> f:\mozilla-source\obj-i686-pc-mingw32\_virtualenvs\init\Scripts\python2.7.exe
> >  1:35.20 Not overwriting existing python script
> f:\mozilla-source\obj-i686-pc-mingw32\_virtualenvs\init\Scripts\python.exe
> (you must use
> f:\mozilla-source\obj-i686-pc-mingw32\_virtualenvs\init\Scripts\python2.7.exe)
> >  1:35.20 Installing setuptools, pip, wheel...done.
> >  1:38.69 f:\mozilla-source\python\mozbuild\mozbuild\virtualenv.py:410:
> UserWarning: Hacking environment to allow binary Python extensions to
> build. You can make this warning go away by installing Visual Studio 2008.
> You can download the Express Edition installer from
> http://go.microsoft.com/?linkid=7729279
> >  1:38.70   warnings.warn('Hacking environment to allow binary Python '
> >  1:38.72 Reexecuting in the virtualenv
> >  1:42.14 Adding configure options from f:\mozilla-source\mozconfig
> >  1:42.26   --enable-application=comm/mail
> >  1:42.34   --enable-calendar
> >  1:42.37 checking for vcs source checkout... hg
> >  1:44.63 checking for a shell... C:/mozilla-build/msys/bin/sh.exe
> >  1:49.84 checking for host system type... i686-pc-mingw32
> >  1:49.84 checking for target system type... i686-pc-mingw32
> >  1:50.52 checking whether cross compiling... no
> >  1:52.30 checking for the target C compiler...
> C:/PROGRA~2/MICROS~2/2017/COMMUN~1/VC/Tools/MSVC/1416~1.270/bin/HostX64/x86/cl.exe
> >  1:54.83 checking whether the target C compiler can be used... yes
> >  1:57.10 checking for Python 3... C:/mozilla-build//python3/python3.exe
> (3.6.5)
> >  1:57.11 checking for hg... c:/mozilla-build/python/Scripts/hg.exe
> >  1:58.79 checking for Mercurial version... 4.5.3
> >  1:59.56 checking for sparse checkout... no
> >  1:59.65 checking for pkg_config... not found
> >  1:59.69 checking for yasm... c:/mozilla-build/bin/yasm.exe
> >  2:00.17 checking yasm version... 1.3.0
> >  2:00.25 checking for nasm... not found
> >  2:00.34 checking the target C compiler version... 19.16.27025
> >  2:02.86 checking the target C compiler works... yes
> >  2:02.90 checking for the target C++ compiler...
> C:/PROGRA~2/MICROS~2/2017/COMMUN~1/VC/Tools/MSVC/1416~1.270/bin/HostX64/x86/cl.exe
> >  2:03.79 checking whether the target C++ compiler can be used... yes
> >  2:03.82 checking the target C++ compiler version... 19.16.27025
> >  2:04.63 checking the target C++ compiler works... yes
> >  2:04.63 checking for the host C compiler...
> C:/PROGRA~2/MICROS~2/2017/COMMUN~1/VC/Tools/MSVC/1416~1.270/bin/HostX64/x86/cl.exe
> >  2:05.01 checking whether the host C compiler can be used... yes
> >  2:05.08 checking the host C compiler version... 19.16.27025
> >  2:05.41 checking the host C compiler works... yes
> >  2:05.41 checking for the host C++ compiler...
> C:/PROGRA~2/MICROS~2/2017/COMMUN~1/VC/Tools/MSVC/1416~1.270/bin/HostX64/x86/cl.exe
> >  2:05.68 checking whether the host C++ compiler can be used... yes
> >  2:05.69 checking the host C++ compiler version... 19.16.27025
> >  2:06.00 checking the host C++ compiler works... yes
> >  2:06.58 checking for 64-bit OS... no
> >  2:06.66 checking for llvm_profdata... not found
> >  2:14.45 checking for Windows SDK... 0x0a00 in 'C:\Program Files
> (x86)\Windows Kits\10\'
> >  2:14.59 checking for Universal CRT SDK... 10.0.17763.0 in 'C:\Program
> Files (x86)\Windows Kits\10\'
> >  2:14.61 checking for the Debug Interface Access SDK...
> C:\PROGRA~2\MICROS~2\2017\COMMUN~1\DIA SDK
> >  2:14.75 checking for mt...
> C:/PROGRA~2/WI3CF2~1/10/bin/100177~1.0/x64/mt.exe
> >  2:15.35 checking whether MT is really Microsoft Manifest Tool... yes
> >  2:15.45 checking for linker...
> C:/PROGRA~2/MICROS~2/2017/COMMUN~1/VC/Tools/MSVC/1416~1.270/bin/HostX64/x86/link.exe
> >  2:15.57 checking for host_linker...
> C:/PROGRA~2/MICROS~2/2017/COMMUN~1/VC/Tools/MSVC/1416~1.270/bin/HostX64/x86/link.exe
> >  2:15.59 checking for makecab... c:/WINDOWS/System32/makecab.exe
> >  2:16.68 checking for the assembler...
> C:/PROGRA~2/MICROS~2/2017/COMMUN~1/VC/Tools/MSVC/1416~1.270/bin/HostX64/x86/ml.exe
> >  2:17.01 checking whether the C compiler supports
> -fsanitize=fuzzer-no-link... yes
> >  2:17.12 checking for rc...
> C:/PROGRA~2/WI3CF2~1/10/bin/100177~1.0/x64/rc.exe
> >  2:17.19 checking for ar...
> C:/PROGRA~2/MICROS~2/2017/COMMUN~1/VC/Tools/MSVC/1416~1.270/bin/HostX64/x86/lib.exe
> >  2:17.67 checking for stdint.h... yes
> >  2:18.42 checking for inttypes.h... yes
> >  2:19.36 checking for malloc.h... yes
> >  2:19.99 checking for alloca.h... no
> >  2:20.27 checking for perf_event_open system call... no
> >  2:21.21 checking for llvm-config... not found
> >  2:21.25 checking bindgen cflags... -x c++ -std=gnu++14
> -fno-sized-deallocation -DTRACING=1 -DIMPL_LIBXUL -DMOZILLA_INTERNAL_API
> -DRUST_BINDGEN -DOS_WIN=1 -DWIN32=1
> >  2:21.34 checking for rustc... c:/Users/calindsey/.cargo/bin/rustc.exe
> >  2:21.42 checking for cargo... c:/Users/calindsey/.cargo/bin/cargo.exe
> >  2:33.06 checking rustc version... 1.31.1
> >  2:34.43 checking cargo version... 1.31.0
> >  2:46.95 checking for rustdoc...
> c:/Users/calindsey/.cargo/bin/rustdoc.exe
> >  2:47.00 checking for cbindgen... not found
> >  2:47.00 DEBUG: cbindgen: Trying cbindgen
> >  2:47.02 DEBUG: cbindgen: Trying c:/Users/calindsey/.cargo/bin/cbindgen
> >  2:47.02 ERROR: Cannot find cbindgen
> >  2:47.24 *** Fix above errors and then restart with\
> >  2:47.24                "./mach build"
> >  2:47.27 mozmake.EXE: *** [client.mk:115: configure] Error 1
>
>
> Hi,
>
> Thanks Bobby!  That helped get me through the previous error.  But, I
> still can't get a successful build.  Below are the results of the latest
> attempt.
>
> I obviously don't want to have to ask for help on every build error.
> Where would be the best place for me to go to lookup what these errors are
> and how to resolve them?
>
> But, if it's something obvious in my configuration, feel free to point it
> out.
>
> Thanks,
> Chris
>
>  0:30.34 Clobber not needed.
>  0:30.38 Adding make options from f:\mozilla-source\mozconfig
>     MOZ_OBJDIR=f:/mozilla-source/obj-i686-pc-mingw32
>     OBJDIR=f:/mozilla-source/obj-i686-pc-mingw32
>     FOUND_MOZCONFIG=f:/mozilla-source/mozconfig
>     export FOUND_MOZCONFIG
>  0:31.80 c:\mozilla-build\bin\mozmake.EXE -f client.mk -s
>  1:29.87 Elapsed: 0.02s; From dist/public: Kept 0 existing; Added/updated
> 0; Removed 0 files and 0 directories.
>  1:31.34 Elapsed: 0.02s; From dist/private: Kept 0 existing; Added/updated
> 0; Removed 0 files and 0 directories.
>  1:34.36 Elapsed: 1.77s; From dist/xpi-stage: Kept 76 existing;
> Added/updated 0; Removed 0 files and 0 directories.
>  1:54.68 Elapsed: 19.00s; From _tests: Kept 0 existing; Added/updated
> 1478; Removed 0 files and 0 directories.
>  2:16.72 Elapsed: 19.56s; From dist/bin: Kept 0 existing; Added/updated
> 2543; Removed 0 files and 0 directories.
>  2:27.09 Elapsed: 57.20s; From dist/include: Kept 0 existing;
> Added/updated 6032; Removed 0 files and 0 directories.
>  3:33.79 js/src/rust/force-cargo-library-build
>  3:33.87 toolkit/library/rust/force-cargo-library-build
>  4:01.74     Blocking waiting for file lock on build directory
>  4:21.59    Compiling mozurl v0.0.1 (F:\mozilla-source\netwerk\base\mozurl)
>  4:29.81    Compiling baldrdash v0.1.0
> (F:\mozilla-source\js\src\wasm\cranelift)
>  4:30.33     Blocking waiting for file lock on build directory
>  4:30.37 error: failed to run custom build command for `baldrdash v0.1.0
> (F:\mozilla-source\js\src\wasm\cranelift)`
>  4:30.37 process didn't exit successfully:
> `f:/mozilla-source/obj-i686-pc-mingw32\release\build\baldrdash-38f50de767197ce4\build-script-build`
> (exit code: 101)
>  4:30.37 --- stdout
>  4:30.37 cargo:rerun-if-changed=baldrapi.h
>  4:30.37
> cargo:rerun-if-changed=f:/mozilla-source/obj-i686-pc-mingw32\js/src/rust/extra-bindgen-flags
>  4:30.37 --- stderr
>  4:30.37 thread 'main' panicked at 'Unable to find libclang: "couldn\'t
> find any valid shared libraries matching: [\'clang.dll\',
> \'libclang.dll\'], set the `LIBCLANG_PATH` environment variable to a path
> where one of these files can be found (invalid: [])"',
> libcore\result.rs:1009:5
>  4:30.37 stack backtrace:
>  4:30.37    0:     0x7ffc719d3ed2 - <std::sync::mpsc::select::Select as
> core::fmt::Debug>::fmt::h3779cdf6deab4fb2
>  4:30.37    1:     0x7ffc719bed7f - std::path::<impl
> core::convert::From<std::path::PathBuf> for
> std::ffi::os_str::OsString>::from::hef69882d0aae8fb6
>  4:30.37    2:     0x7ffc719b9038 -
> std::panicking::take_hook::h28cd6f8e37a0a07d
>  4:30.37    3:     0x7ffc719b8cf1 -
> std::panicking::take_hook::h28cd6f8e37a0a07d
>  4:30.37    4:     0x7ffc719b989c -
> std::panicking::rust_panic_with_hook::h83c643dba7ec424c
>  4:30.37    5:     0x7ffc719b93c3 -
> std::panicking::begin_panic_fmt::hdc3de53d5c0ccc24
>  4:30.37    6:     0x7ffc719b92a8 - rust_begin_unwind
>  4:30.37    7:     0x7ffc719edbdb -
> core::panicking::panic_fmt::ha79ca86aa4b70ade
>  4:30.37    8:     0x7ff6e10a80c6 - <&T as
> core::convert::AsRef<U>>::as_ref::h703ff844f1016e01
>  4:30.37    9:     0x7ff6e109a182 - <&T as
> core::convert::AsRef<U>>::as_ref::h703ff844f1016e01
>  4:30.37   10:     0x7ffc719dfc18 -
> std::sync::once::Once::call_inner::h314cd51909d142ef
>  4:30.37   11:     0x7ff6e116d51d -
> bindgen::Builder::generate::h657cfddd494ecf1a
>  4:30.37   12:     0x7ff6e1097776 -
> core::alloc::size_align::h9cf92d476a11de20
>  4:30.37   13:     0x7ff6e1091f85 - std::rt::lang_start::h4fba4b55d34bb956
>  4:30.37   14:     0x7ffc719b9206 -
> std::panicking::update_panic_count::hf9e0b184b1baf22b
>  4:30.37   15:     0x7ffc719eaa61 - _rust_maybe_catch_panic
>  4:30.37   16:     0x7ffc719c8a82 -
> std::rt::lang_start_internal::h8f028255e9554163
>  4:30.39   17:     0x7ff6e1091f72 - std::rt::lang_start::h4fba4b55d34bb956
>  4:30.39   18:     0x7ff6e123ee13 - invoke_main
>  4:30.39                                at
> d:\agent\_work\3\s\src\vctools\crt\vcstartup\src\startup\exe_common.inl:78
>  4:30.39   19:     0x7ff6e123ee13 - invoke_main
>  4:30.39                                at
> d:\agent\_work\3\s\src\vctools\crt\vcstartup\src\startup\exe_common.inl:78
>  4:30.39   20:     0x7ffca1163033 - BaseThreadInitThunk
>  4:30.39   21:     0x7ffca3a53690 - RtlUserThreadStart
>  4:30.81 mozmake.EXE[4]: *** [f:/mozilla-source/config/rules.mk:1040:
> force-cargo-library-build] Error 101
>  4:30.84 mozmake.EXE[3]: *** [f:/mozilla-source/config/recurse.mk:74:
> toolkit/library/rust/target] Error 2
>  4:30.84 mozmake.EXE[3]: *** Waiting for unfinished jobs....
>  4:31.34    Compiling baldrdash v0.1.0
> (F:\mozilla-source\js\src\wasm\cranelift)
>  4:31.34    Compiling target-lexicon v0.2.0
>  4:31.83 error: failed to run custom build command for `baldrdash v0.1.0
> (F:\mozilla-source\js\src\wasm\cranelift)`
>  4:31.83 process didn't exit successfully:
> `f:/mozilla-source/obj-i686-pc-mingw32\release\build\baldrdash-38f50de767197ce4\build-script-build`
> (exit code: 101)
>  4:31.83 --- stdout
>  4:31.83 cargo:rerun-if-changed=baldrapi.h
>  4:31.83
> cargo:rerun-if-changed=f:/mozilla-source/obj-i686-pc-mingw32\js/src/rust/extra-bindgen-flags
>  4:31.83 --- stderr
>  4:31.83 thread 'main' panicked at 'Unable to find libclang: "couldn\'t
> find any valid shared libraries matching: [\'clang.dll\',
> \'libclang.dll\'], set the `LIBCLANG_PATH` environment variable to a path
> where one of these files can be found (invalid: [])"',
> libcore\result.rs:1009:5
>  4:31.83 stack backtrace:
>  4:31.83    0:     0x7ffc719d3ed2 - <std::sync::mpsc::select::Select as
> core::fmt::Debug>::fmt::h3779cdf6deab4fb2
>  4:31.83    1:     0x7ffc719bed7f - std::path::<impl
> core::convert::From<std::path::PathBuf> for
> std::ffi::os_str::OsString>::from::hef69882d0aae8fb6
>  4:31.83    2:     0x7ffc719b9038 -
> std::panicking::take_hook::h28cd6f8e37a0a07d
>  4:31.83    3:     0x7ffc719b8cf1 -
> std::panicking::take_hook::h28cd6f8e37a0a07d
>  4:31.83    4:     0x7ffc719b989c -
> std::panicking::rust_panic_with_hook::h83c643dba7ec424c
>  4:31.83    5:     0x7ffc719b93c3 -
> std::panicking::begin_panic_fmt::hdc3de53d5c0ccc24
>  4:31.83    6:     0x7ffc719b92a8 - rust_begin_unwind
>  4:31.83    7:     0x7ffc719edbdb -
> core::panicking::panic_fmt::ha79ca86aa4b70ade
>  4:31.83    8:     0x7ff6e10a80c6 - <&T as
> core::convert::AsRef<U>>::as_ref::h703ff844f1016e01
>  4:31.83    9:     0x7ff6e109a182 - <&T as
> core::convert::AsRef<U>>::as_ref::h703ff844f1016e01
>  4:31.83   10:     0x7ffc719dfc18 -
> std::sync::once::Once::call_inner::h314cd51909d142ef
>  4:31.83   11:     0x7ff6e116d51d -
> bindgen::Builder::generate::h657cfddd494ecf1a
>  4:31.83   12:     0x7ff6e1097776 -
> core::alloc::size_align::h9cf92d476a11de20
>  4:31.84   13:     0x7ff6e1091f85 - std::rt::lang_start::h4fba4b55d34bb956
>  4:31.84   14:     0x7ffc719b9206 -
> std::panicking::update_panic_count::hf9e0b184b1baf22b
>  4:31.84   15:     0x7ffc719eaa61 - _rust_maybe_catch_panic
>  4:31.84   16:     0x7ffc719c8a82 -
> std::rt::lang_start_internal::h8f028255e9554163
>  4:31.84   17:     0x7ff6e1091f72 - std::rt::lang_start::h4fba4b55d34bb956
>  4:31.84   18:     0x7ff6e123ee13 - invoke_main
>  4:31.84                                at
> d:\agent\_work\3\s\src\vctools\crt\vcstartup\src\startup\exe_common.inl:78
>  4:31.84   19:     0x7ff6e123ee13 - invoke_main
>  4:31.84                                at
> d:\agent\_work\3\s\src\vctools\crt\vcstartup\src\startup\exe_common.inl:78
>  4:31.84   20:     0x7ffca1163033 - BaseThreadInitThunk
>  4:31.84   21:     0x7ffca3a53690 - RtlUserThreadStart
>  4:31.84 warning: build failed, waiting for other jobs to finish...
>  4:31.95 error: build failed
>  4:32.06 mozmake.EXE[4]: *** [f:/mozilla-source/config/rules.mk:1040:
> force-cargo-library-build] Error 101
>  4:32.06 mozmake.EXE[3]: *** [f:/mozilla-source/config/recurse.mk:74:
> js/src/rust/target] Error 2
>  4:32.08 mozmake.EXE[2]: *** [f:/mozilla-source/config/recurse.mk:34:
> compile] Error 2
>  4:32.09 mozmake.EXE[1]: *** [f:/mozilla-source/config/rules.mk:424:
> default] Error 2
>  4:32.12 mozmake.EXE: *** [client.mk:125: build] Error 2
>  4:32.19 0 compiler warnings present.
> _______________________________________________
> dev-builds mailing list
> dev-builds@lists.mozilla.org
> https://lists.mozilla.org/listinfo/dev-builds
>

--000000000000b1642d057e40d952
Content-Type: text/html; charset="UTF-8"
Content-Transfer-Encoding: quoted-printable

<div dir=3D"auto">Try: ./mach bootstrap</div><br><div class=3D"gmail_quote"=
><div dir=3D"ltr">On Sat, Dec 29, 2018, 22:05  &lt;<a href=3D"mailto:Chris@=
christopherlindsey.com">Chris@christopherlindsey.com</a> wrote:<br></div><b=
lockquote class=3D"gmail_quote" style=3D"margin:0 0 0 .8ex;border-left:1px =
#ccc solid;padding-left:1ex">On Saturday, December 29, 2018 at 5:43:43 PM U=
TC-7, <a href=3D"mailto:ch...@christopherlindsey.com" target=3D"_blank" rel=
=3D"noreferrer">ch...@christopherlindsey.com</a> wrote:<br>
&gt; Hi,<br>
&gt; <br>
&gt; I&#39;m trying to set up a development environment for Thunderbird for=
 the first time and am following the instructions for a Windows machine at:=
 <a href=3D"https://developer.mozilla.org/en-US/docs/Mozilla/Developer_guid=
e/Build_Instructions/Simple_Thunderbird_build" rel=3D"noreferrer noreferrer=
" target=3D"_blank">https://developer.mozilla.org/en-US/docs/Mozilla/Develo=
per_guide/Build_Instructions/Simple_Thunderbird_build</a><br>
&gt; <br>
&gt; I&#39;ve been searching everywhere I could think of for a solution to =
the below error with no success and I&#39;m not sure where to go from here.=
<br>
&gt; <br>
&gt; Any suggestions?<br>
&gt; <br>
&gt; Thank you,<br>
&gt; Chris<br>
&gt; <br>
&gt; <br>
&gt; <br>
&gt; $ ./mach build<br>
&gt;=C2=A0 Config object not found by mach.<br>
&gt;=C2=A0 0:24.82 Clobber not needed.<br>
&gt;=C2=A0 0:24.89 Adding make options from f:\mozilla-source\mozconfig<br>
&gt;=C2=A0 =C2=A0 =C2=A0MOZ_OBJDIR=3Df:/mozilla-source/obj-i686-pc-mingw32<=
br>
&gt;=C2=A0 =C2=A0 =C2=A0OBJDIR=3Df:/mozilla-source/obj-i686-pc-mingw32<br>
&gt;=C2=A0 =C2=A0 =C2=A0FOUND_MOZCONFIG=3Df:/mozilla-source/mozconfig<br>
&gt;=C2=A0 =C2=A0 =C2=A0export FOUND_MOZCONFIG<br>
&gt;=C2=A0 0:27.13 c:\mozilla-build\bin\mozmake.EXE -f <a href=3D"http://cl=
ient.mk" rel=3D"noreferrer noreferrer" target=3D"_blank">client.mk</a> -s c=
onfigure<br>
&gt;=C2=A0 0:27.91 cd f:/mozilla-source/obj-i686-pc-mingw32<br>
&gt;=C2=A0 0:28.11 f:/mozilla-source/configure<br>
&gt;=C2=A0 0:31.84 Creating Python environment<br>
&gt;=C2=A0 1:35.19 New python executable in f:\mozilla-source\obj-i686-pc-m=
ingw32\_virtualenvs\init\Scripts\python2.7.exe<br>
&gt;=C2=A0 1:35.20 Not overwriting existing python script f:\mozilla-source=
\obj-i686-pc-mingw32\_virtualenvs\init\Scripts\python.exe (you must use f:\=
mozilla-source\obj-i686-pc-mingw32\_virtualenvs\init\Scripts\python2.7.exe)=
<br>
&gt;=C2=A0 1:35.20 Installing setuptools, pip, wheel...done.<br>
&gt;=C2=A0 1:38.69 f:\mozilla-source\python\mozbuild\mozbuild\virtualenv.py=
:410: UserWarning: Hacking environment to allow binary Python extensions to=
 build. You can make this warning go away by installing Visual Studio 2008.=
 You can download the Express Edition installer from <a href=3D"http://go.m=
icrosoft.com/?linkid=3D7729279" rel=3D"noreferrer noreferrer" target=3D"_bl=
ank">http://go.microsoft.com/?linkid=3D7729279</a><br>
&gt;=C2=A0 1:38.70=C2=A0 =C2=A0warnings.warn(&#39;Hacking environment to al=
low binary Python &#39;<br>
&gt;=C2=A0 1:38.72 Reexecuting in the virtualenv<br>
&gt;=C2=A0 1:42.14 Adding configure options from f:\mozilla-source\mozconfi=
g<br>
&gt;=C2=A0 1:42.26=C2=A0 =C2=A0--enable-application=3Dcomm/mail<br>
&gt;=C2=A0 1:42.34=C2=A0 =C2=A0--enable-calendar<br>
&gt;=C2=A0 1:42.37 checking for vcs source checkout... hg<br>
&gt;=C2=A0 1:44.63 checking for a shell... C:/mozilla-build/msys/bin/sh.exe=
<br>
&gt;=C2=A0 1:49.84 checking for host system type... i686-pc-mingw32<br>
&gt;=C2=A0 1:49.84 checking for target system type... i686-pc-mingw32<br>
&gt;=C2=A0 1:50.52 checking whether cross compiling... no<br>
&gt;=C2=A0 1:52.30 checking for the target C compiler... C:/PROGRA~2/MICROS=
~2/2017/COMMUN~1/VC/Tools/MSVC/1416~1.270/bin/HostX64/x86/cl.exe<br>
&gt;=C2=A0 1:54.83 checking whether the target C compiler can be used... ye=
s<br>
&gt;=C2=A0 1:57.10 checking for Python 3... C:/mozilla-build//python3/pytho=
n3.exe (3.6.5)<br>
&gt;=C2=A0 1:57.11 checking for hg... c:/mozilla-build/python/Scripts/hg.ex=
e<br>
&gt;=C2=A0 1:58.79 checking for Mercurial version... 4.5.3<br>
&gt;=C2=A0 1:59.56 checking for sparse checkout... no<br>
&gt;=C2=A0 1:59.65 checking for pkg_config... not found<br>
&gt;=C2=A0 1:59.69 checking for yasm... c:/mozilla-build/bin/yasm.exe<br>
&gt;=C2=A0 2:00.17 checking yasm version... 1.3.0<br>
&gt;=C2=A0 2:00.25 checking for nasm... not found<br>
&gt;=C2=A0 2:00.34 checking the target C compiler version... 19.16.27025<br=
>
&gt;=C2=A0 2:02.86 checking the target C compiler works... yes<br>
&gt;=C2=A0 2:02.90 checking for the target C++ compiler... C:/PROGRA~2/MICR=
OS~2/2017/COMMUN~1/VC/Tools/MSVC/1416~1.270/bin/HostX64/x86/cl.exe<br>
&gt;=C2=A0 2:03.79 checking whether the target C++ compiler can be used... =
yes<br>
&gt;=C2=A0 2:03.82 checking the target C++ compiler version... 19.16.27025<=
br>
&gt;=C2=A0 2:04.63 checking the target C++ compiler works... yes<br>
&gt;=C2=A0 2:04.63 checking for the host C compiler... C:/PROGRA~2/MICROS~2=
/2017/COMMUN~1/VC/Tools/MSVC/1416~1.270/bin/HostX64/x86/cl.exe<br>
&gt;=C2=A0 2:05.01 checking whether the host C compiler can be used... yes<=
br>
&gt;=C2=A0 2:05.08 checking the host C compiler version... 19.16.27025<br>
&gt;=C2=A0 2:05.41 checking the host C compiler works... yes<br>
&gt;=C2=A0 2:05.41 checking for the host C++ compiler... C:/PROGRA~2/MICROS=
~2/2017/COMMUN~1/VC/Tools/MSVC/1416~1.270/bin/HostX64/x86/cl.exe<br>
&gt;=C2=A0 2:05.68 checking whether the host C++ compiler can be used... ye=
s<br>
&gt;=C2=A0 2:05.69 checking the host C++ compiler version... 19.16.27025<br=
>
&gt;=C2=A0 2:06.00 checking the host C++ compiler works... yes<br>
&gt;=C2=A0 2:06.58 checking for 64-bit OS... no<br>
&gt;=C2=A0 2:06.66 checking for llvm_profdata... not found<br>
&gt;=C2=A0 2:14.45 checking for Windows SDK... 0x0a00 in &#39;C:\Program Fi=
les (x86)\Windows Kits\10\&#39;<br>
&gt;=C2=A0 2:14.59 checking for Universal CRT SDK... 10.0.17763.0 in &#39;C=
:\Program Files (x86)\Windows Kits\10\&#39;<br>
&gt;=C2=A0 2:14.61 checking for the Debug Interface Access SDK... C:\PROGRA=
~2\MICROS~2\2017\COMMUN~1\DIA SDK<br>
&gt;=C2=A0 2:14.75 checking for mt... C:/PROGRA~2/WI3CF2~1/10/bin/100177~1.=
0/x64/mt.exe<br>
&gt;=C2=A0 2:15.35 checking whether MT is really Microsoft Manifest Tool...=
 yes<br>
&gt;=C2=A0 2:15.45 checking for linker... C:/PROGRA~2/MICROS~2/2017/COMMUN~=
1/VC/Tools/MSVC/1416~1.270/bin/HostX64/x86/link.exe<br>
&gt;=C2=A0 2:15.57 checking for host_linker... C:/PROGRA~2/MICROS~2/2017/CO=
MMUN~1/VC/Tools/MSVC/1416~1.270/bin/HostX64/x86/link.exe<br>
&gt;=C2=A0 2:15.59 checking for makecab... c:/WINDOWS/System32/makecab.exe<=
br>
&gt;=C2=A0 2:16.68 checking for the assembler... C:/PROGRA~2/MICROS~2/2017/=
COMMUN~1/VC/Tools/MSVC/1416~1.270/bin/HostX64/x86/ml.exe<br>
&gt;=C2=A0 2:17.01 checking whether the C compiler supports -fsanitize=3Dfu=
zzer-no-link... yes<br>
&gt;=C2=A0 2:17.12 checking for rc... C:/PROGRA~2/WI3CF2~1/10/bin/100177~1.=
0/x64/rc.exe<br>
&gt;=C2=A0 2:17.19 checking for ar... C:/PROGRA~2/MICROS~2/2017/COMMUN~1/VC=
/Tools/MSVC/1416~1.270/bin/HostX64/x86/lib.exe<br>
&gt;=C2=A0 2:17.67 checking for stdint.h... yes<br>
&gt;=C2=A0 2:18.42 checking for inttypes.h... yes<br>
&gt;=C2=A0 2:19.36 checking for malloc.h... yes<br>
&gt;=C2=A0 2:19.99 checking for alloca.h... no<br>
&gt;=C2=A0 2:20.27 checking for perf_event_open system call... no<br>
&gt;=C2=A0 2:21.21 checking for llvm-config... not found<br>
&gt;=C2=A0 2:21.25 checking bindgen cflags... -x c++ -std=3Dgnu++14 -fno-si=
zed-deallocation -DTRACING=3D1 -DIMPL_LIBXUL -DMOZILLA_INTERNAL_API -DRUST_=
BINDGEN -DOS_WIN=3D1 -DWIN32=3D1<br>
&gt;=C2=A0 2:21.34 checking for rustc... c:/Users/calindsey/.cargo/bin/rust=
c.exe<br>
&gt;=C2=A0 2:21.42 checking for cargo... c:/Users/calindsey/.cargo/bin/carg=
o.exe<br>
&gt;=C2=A0 2:33.06 checking rustc version... 1.31.1<br>
&gt;=C2=A0 2:34.43 checking cargo version... 1.31.0<br>
&gt;=C2=A0 2:46.95 checking for rustdoc... c:/Users/calindsey/.cargo/bin/ru=
stdoc.exe<br>
&gt;=C2=A0 2:47.00 checking for cbindgen... not found<br>
&gt;=C2=A0 2:47.00 DEBUG: cbindgen: Trying cbindgen<br>
&gt;=C2=A0 2:47.02 DEBUG: cbindgen: Trying c:/Users/calindsey/.cargo/bin/cb=
indgen<br>
&gt;=C2=A0 2:47.02 ERROR: Cannot find cbindgen<br>
&gt;=C2=A0 2:47.24 *** Fix above errors and then restart with\<br>
&gt;=C2=A0 2:47.24=C2=A0 =C2=A0 =C2=A0 =C2=A0 =C2=A0 =C2=A0 =C2=A0 =C2=A0 &=
quot;./mach build&quot;<br>
&gt;=C2=A0 2:47.27 mozmake.EXE: *** [<a href=3D"http://client.mk:115" rel=
=3D"noreferrer noreferrer" target=3D"_blank">client.mk:115</a>: configure] =
Error 1<br>
<br>
<br>
Hi,<br>
<br>
Thanks Bobby!=C2=A0 That helped get me through the previous error.=C2=A0 Bu=
t, I still can&#39;t get a successful build.=C2=A0 Below are the results of=
 the latest attempt.<br>
<br>
I obviously don&#39;t want to have to ask for help on every build error.=C2=
=A0 Where would be the best place for me to go to lookup what these errors =
are and how to resolve them?<br>
<br>
But, if it&#39;s something obvious in my configuration, feel free to point =
it out.<br>
<br>
Thanks,<br>
Chris<br>
<br>
=C2=A00:30.34 Clobber not needed.<br>
=C2=A00:30.38 Adding make options from f:\mozilla-source\mozconfig<br>
=C2=A0 =C2=A0 MOZ_OBJDIR=3Df:/mozilla-source/obj-i686-pc-mingw32<br>
=C2=A0 =C2=A0 OBJDIR=3Df:/mozilla-source/obj-i686-pc-mingw32<br>
=C2=A0 =C2=A0 FOUND_MOZCONFIG=3Df:/mozilla-source/mozconfig<br>
=C2=A0 =C2=A0 export FOUND_MOZCONFIG<br>
=C2=A00:31.80 c:\mozilla-build\bin\mozmake.EXE -f <a href=3D"http://client.=
mk" rel=3D"noreferrer noreferrer" target=3D"_blank">client.mk</a> -s<br>
=C2=A01:29.87 Elapsed: 0.02s; From dist/public: Kept 0 existing; Added/upda=
ted 0; Removed 0 files and 0 directories.<br>
=C2=A01:31.34 Elapsed: 0.02s; From dist/private: Kept 0 existing; Added/upd=
ated 0; Removed 0 files and 0 directories.<br>
=C2=A01:34.36 Elapsed: 1.77s; From dist/xpi-stage: Kept 76 existing; Added/=
updated 0; Removed 0 files and 0 directories.<br>
=C2=A01:54.68 Elapsed: 19.00s; From _tests: Kept 0 existing; Added/updated =
1478; Removed 0 files and 0 directories.<br>
=C2=A02:16.72 Elapsed: 19.56s; From dist/bin: Kept 0 existing; Added/update=
d 2543; Removed 0 files and 0 directories.<br>
=C2=A02:27.09 Elapsed: 57.20s; From dist/include: Kept 0 existing; Added/up=
dated 6032; Removed 0 files and 0 directories.<br>
=C2=A03:33.79 js/src/rust/force-cargo-library-build<br>
=C2=A03:33.87 toolkit/library/rust/force-cargo-library-build<br>
=C2=A04:01.74=C2=A0 =C2=A0 =C2=A0Blocking waiting for file lock on build di=
rectory<br>
=C2=A04:21.59=C2=A0 =C2=A0 Compiling mozurl v0.0.1 (F:\mozilla-source\netwe=
rk\base\mozurl)<br>
=C2=A04:29.81=C2=A0 =C2=A0 Compiling baldrdash v0.1.0 (F:\mozilla-source\js=
\src\wasm\cranelift)<br>
=C2=A04:30.33=C2=A0 =C2=A0 =C2=A0Blocking waiting for file lock on build di=
rectory<br>
=C2=A04:30.37 error: failed to run custom build command for `baldrdash v0.1=
..0 (F:\mozilla-source\js\src\wasm\cranelift)`<br>
=C2=A04:30.37 process didn&#39;t exit successfully: `f:/mozilla-source/obj-=
i686-pc-mingw32\release\build\baldrdash-38f50de767197ce4\build-script-build=
` (exit code: 101)<br>
=C2=A04:30.37 --- stdout<br>
=C2=A04:30.37 cargo:rerun-if-changed=3Dbaldrapi.h<br>
=C2=A04:30.37 cargo:rerun-if-changed=3Df:/mozilla-source/obj-i686-pc-mingw3=
2\js/src/rust/extra-bindgen-flags<br>
=C2=A04:30.37 --- stderr<br>
=C2=A04:30.37 thread &#39;main&#39; panicked at &#39;Unable to find libclan=
g: &quot;couldn\&#39;t find any valid shared libraries matching: [\&#39;cla=
ng.dll\&#39;, \&#39;libclang.dll\&#39;], set the `LIBCLANG_PATH` environmen=
t variable to a path where one of these files can be found (invalid: [])&qu=
ot;&#39;, libcore\result.rs:1009:5<br>
=C2=A04:30.37 stack backtrace:<br>
=C2=A04:30.37=C2=A0 =C2=A0 0:=C2=A0 =C2=A0 =C2=A00x7ffc719d3ed2 - &lt;std::=
sync::mpsc::select::Select as core::fmt::Debug&gt;::fmt::h3779cdf6deab4fb2<=
br>
=C2=A04:30.37=C2=A0 =C2=A0 1:=C2=A0 =C2=A0 =C2=A00x7ffc719bed7f - std::path=
::&lt;impl core::convert::From&lt;std::path::PathBuf&gt; for std::ffi::os_s=
tr::OsString&gt;::from::hef69882d0aae8fb6<br>
=C2=A04:30.37=C2=A0 =C2=A0 2:=C2=A0 =C2=A0 =C2=A00x7ffc719b9038 - std::pani=
cking::take_hook::h28cd6f8e37a0a07d<br>
=C2=A04:30.37=C2=A0 =C2=A0 3:=C2=A0 =C2=A0 =C2=A00x7ffc719b8cf1 - std::pani=
cking::take_hook::h28cd6f8e37a0a07d<br>
=C2=A04:30.37=C2=A0 =C2=A0 4:=C2=A0 =C2=A0 =C2=A00x7ffc719b989c - std::pani=
cking::rust_panic_with_hook::h83c643dba7ec424c<br>
=C2=A04:30.37=C2=A0 =C2=A0 5:=C2=A0 =C2=A0 =C2=A00x7ffc719b93c3 - std::pani=
cking::begin_panic_fmt::hdc3de53d5c0ccc24<br>
=C2=A04:30.37=C2=A0 =C2=A0 6:=C2=A0 =C2=A0 =C2=A00x7ffc719b92a8 - rust_begi=
n_unwind<br>
=C2=A04:30.37=C2=A0 =C2=A0 7:=C2=A0 =C2=A0 =C2=A00x7ffc719edbdb - core::pan=
icking::panic_fmt::ha79ca86aa4b70ade<br>
=C2=A04:30.37=C2=A0 =C2=A0 8:=C2=A0 =C2=A0 =C2=A00x7ff6e10a80c6 - &lt;&amp;=
T as core::convert::AsRef&lt;U&gt;&gt;::as_ref::h703ff844f1016e01<br>
=C2=A04:30.37=C2=A0 =C2=A0 9:=C2=A0 =C2=A0 =C2=A00x7ff6e109a182 - &lt;&amp;=
T as core::convert::AsRef&lt;U&gt;&gt;::as_ref::h703ff844f1016e01<br>
=C2=A04:30.37=C2=A0 =C2=A010:=C2=A0 =C2=A0 =C2=A00x7ffc719dfc18 - std::sync=
::once::Once::call_inner::h314cd51909d142ef<br>
=C2=A04:30.37=C2=A0 =C2=A011:=C2=A0 =C2=A0 =C2=A00x7ff6e116d51d - bindgen::=
Builder::generate::h657cfddd494ecf1a<br>
=C2=A04:30.37=C2=A0 =C2=A012:=C2=A0 =C2=A0 =C2=A00x7ff6e1097776 - core::all=
oc::size_align::h9cf92d476a11de20<br>
=C2=A04:30.37=C2=A0 =C2=A013:=C2=A0 =C2=A0 =C2=A00x7ff6e1091f85 - std::rt::=
lang_start::h4fba4b55d34bb956<br>
=C2=A04:30.37=C2=A0 =C2=A014:=C2=A0 =C2=A0 =C2=A00x7ffc719b9206 - std::pani=
cking::update_panic_count::hf9e0b184b1baf22b<br>
=C2=A04:30.37=C2=A0 =C2=A015:=C2=A0 =C2=A0 =C2=A00x7ffc719eaa61 - _rust_may=
be_catch_panic<br>
=C2=A04:30.37=C2=A0 =C2=A016:=C2=A0 =C2=A0 =C2=A00x7ffc719c8a82 - std::rt::=
lang_start_internal::h8f028255e9554163<br>
=C2=A04:30.39=C2=A0 =C2=A017:=C2=A0 =C2=A0 =C2=A00x7ff6e1091f72 - std::rt::=
lang_start::h4fba4b55d34bb956<br>
=C2=A04:30.39=C2=A0 =C2=A018:=C2=A0 =C2=A0 =C2=A00x7ff6e123ee13 - invoke_ma=
in<br>
=C2=A04:30.39=C2=A0 =C2=A0 =C2=A0 =C2=A0 =C2=A0 =C2=A0 =C2=A0 =C2=A0 =C2=A0=
 =C2=A0 =C2=A0 =C2=A0 =C2=A0 =C2=A0 =C2=A0 =C2=A0 at d:\agent\_work\3\s\src=
\vctools\crt\vcstartup\src\startup\exe_common.inl:78<br>
=C2=A04:30.39=C2=A0 =C2=A019:=C2=A0 =C2=A0 =C2=A00x7ff6e123ee13 - invoke_ma=
in<br>
=C2=A04:30.39=C2=A0 =C2=A0 =C2=A0 =C2=A0 =C2=A0 =C2=A0 =C2=A0 =C2=A0 =C2=A0=
 =C2=A0 =C2=A0 =C2=A0 =C2=A0 =C2=A0 =C2=A0 =C2=A0 at d:\agent\_work\3\s\src=
\vctools\crt\vcstartup\src\startup\exe_common.inl:78<br>
=C2=A04:30.39=C2=A0 =C2=A020:=C2=A0 =C2=A0 =C2=A00x7ffca1163033 - BaseThrea=
dInitThunk<br>
=C2=A04:30.39=C2=A0 =C2=A021:=C2=A0 =C2=A0 =C2=A00x7ffca3a53690 - RtlUserTh=
readStart<br>
=C2=A04:30.81 mozmake.EXE[4]: *** [f:/mozilla-source/config/<a href=3D"http=
://rules.mk:1040" rel=3D"noreferrer noreferrer" target=3D"_blank">rules.mk:=
1040</a>: force-cargo-library-build] Error 101<br>
=C2=A04:30.84 mozmake.EXE[3]: *** [f:/mozilla-source/config/<a href=3D"http=
://recurse.mk:74" rel=3D"noreferrer noreferrer" target=3D"_blank">recurse.m=
k:74</a>: toolkit/library/rust/target] Error 2<br>
=C2=A04:30.84 mozmake.EXE[3]: *** Waiting for unfinished jobs....<br>
=C2=A04:31.34=C2=A0 =C2=A0 Compiling baldrdash v0.1.0 (F:\mozilla-source\js=
\src\wasm\cranelift)<br>
=C2=A04:31.34=C2=A0 =C2=A0 Compiling target-lexicon v0.2.0<br>
=C2=A04:31.83 error: failed to run custom build command for `baldrdash v0.1=
..0 (F:\mozilla-source\js\src\wasm\cranelift)`<br>
=C2=A04:31.83 process didn&#39;t exit successfully: `f:/mozilla-source/obj-=
i686-pc-mingw32\release\build\baldrdash-38f50de767197ce4\build-script-build=
` (exit code: 101)<br>
=C2=A04:31.83 --- stdout<br>
=C2=A04:31.83 cargo:rerun-if-changed=3Dbaldrapi.h<br>
=C2=A04:31.83 cargo:rerun-if-changed=3Df:/mozilla-source/obj-i686-pc-mingw3=
2\js/src/rust/extra-bindgen-flags<br>
=C2=A04:31.83 --- stderr<br>
=C2=A04:31.83 thread &#39;main&#39; panicked at &#39;Unable to find libclan=
g: &quot;couldn\&#39;t find any valid shared libraries matching: [\&#39;cla=
ng.dll\&#39;, \&#39;libclang.dll\&#39;], set the `LIBCLANG_PATH` environmen=
t variable to a path where one of these files can be found (invalid: [])&qu=
ot;&#39;, libcore\result.rs:1009:5<br>
=C2=A04:31.83 stack backtrace:<br>
=C2=A04:31.83=C2=A0 =C2=A0 0:=C2=A0 =C2=A0 =C2=A00x7ffc719d3ed2 - &lt;std::=
sync::mpsc::select::Select as core::fmt::Debug&gt;::fmt::h3779cdf6deab4fb2<=
br>
=C2=A04:31.83=C2=A0 =C2=A0 1:=C2=A0 =C2=A0 =C2=A00x7ffc719bed7f - std::path=
::&lt;impl core::convert::From&lt;std::path::PathBuf&gt; for std::ffi::os_s=
tr::OsString&gt;::from::hef69882d0aae8fb6<br>
=C2=A04:31.83=C2=A0 =C2=A0 2:=C2=A0 =C2=A0 =C2=A00x7ffc719b9038 - std::pani=
cking::take_hook::h28cd6f8e37a0a07d<br>
=C2=A04:31.83=C2=A0 =C2=A0 3:=C2=A0 =C2=A0 =C2=A00x7ffc719b8cf1 - std::pani=
cking::take_hook::h28cd6f8e37a0a07d<br>
=C2=A04:31.83=C2=A0 =C2=A0 4:=C2=A0 =C2=A0 =C2=A00x7ffc719b989c - std::pani=
cking::rust_panic_with_hook::h83c643dba7ec424c<br>
=C2=A04:31.83=C2=A0 =C2=A0 5:=C2=A0 =C2=A0 =C2=A00x7ffc719b93c3 - std::pani=
cking::begin_panic_fmt::hdc3de53d5c0ccc24<br>
=C2=A04:31.83=C2=A0 =C2=A0 6:=C2=A0 =C2=A0 =C2=A00x7ffc719b92a8 - rust_begi=
n_unwind<br>
=C2=A04:31.83=C2=A0 =C2=A0 7:=C2=A0 =C2=A0 =C2=A00x7ffc719edbdb - core::pan=
icking::panic_fmt::ha79ca86aa4b70ade<br>
=C2=A04:31.83=C2=A0 =C2=A0 8:=C2=A0 =C2=A0 =C2=A00x7ff6e10a80c6 - &lt;&amp;=
T as core::convert::AsRef&lt;U&gt;&gt;::as_ref::h703ff844f1016e01<br>
=C2=A04:31.83=C2=A0 =C2=A0 9:=C2=A0 =C2=A0 =C2=A00x7ff6e109a182 - &lt;&amp;=
T as core::convert::AsRef&lt;U&gt;&gt;::as_ref::h703ff844f1016e01<br>
=C2=A04:31.83=C2=A0 =C2=A010:=C2=A0 =C2=A0 =C2=A00x7ffc719dfc18 - std::sync=
::once::Once::call_inner::h314cd51909d142ef<br>
=C2=A04:31.83=C2=A0 =C2=A011:=C2=A0 =C2=A0 =C2=A00x7ff6e116d51d - bindgen::=
Builder::generate::h657cfddd494ecf1a<br>
=C2=A04:31.83=C2=A0 =C2=A012:=C2=A0 =C2=A0 =C2=A00x7ff6e1097776 - core::all=
oc::size_align::h9cf92d476a11de20<br>
=C2=A04:31.84=C2=A0 =C2=A013:=C2=A0 =C2=A0 =C2=A00x7ff6e1091f85 - std::rt::=
lang_start::h4fba4b55d34bb956<br>
=C2=A04:31.84=C2=A0 =C2=A014:=C2=A0 =C2=A0 =C2=A00x7ffc719b9206 - std::pani=
cking::update_panic_count::hf9e0b184b1baf22b<br>
=C2=A04:31.84=C2=A0 =C2=A015:=C2=A0 =C2=A0 =C2=A00x7ffc719eaa61 - _rust_may=
be_catch_panic<br>
=C2=A04:31.84=C2=A0 =C2=A016:=C2=A0 =C2=A0 =C2=A00x7ffc719c8a82 - std::rt::=
lang_start_internal::h8f028255e9554163<br>
=C2=A04:31.84=C2=A0 =C2=A017:=C2=A0 =C2=A0 =C2=A00x7ff6e1091f72 - std::rt::=
lang_start::h4fba4b55d34bb956<br>
=C2=A04:31.84=C2=A0 =C2=A018:=C2=A0 =C2=A0 =C2=A00x7ff6e123ee13 - invoke_ma=
in<br>
=C2=A04:31.84=C2=A0 =C2=A0 =C2=A0 =C2=A0 =C2=A0 =C2=A0 =C2=A0 =C2=A0 =C2=A0=
 =C2=A0 =C2=A0 =C2=A0 =C2=A0 =C2=A0 =C2=A0 =C2=A0 at d:\agent\_work\3\s\src=
\vctools\crt\vcstartup\src\startup\exe_common.inl:78<br>
=C2=A04:31.84=C2=A0 =C2=A019:=C2=A0 =C2=A0 =C2=A00x7ff6e123ee13 - invoke_ma=
in<br>
=C2=A04:31.84=C2=A0 =C2=A0 =C2=A0 =C2=A0 =C2=A0 =C2=A0 =C2=A0 =C2=A0 =C2=A0=
 =C2=A0 =C2=A0 =C2=A0 =C2=A0 =C2=A0 =C2=A0 =C2=A0 at d:\agent\_work\3\s\src=
\vctools\crt\vcstartup\src\startup\exe_common.inl:78<br>
=C2=A04:31.84=C2=A0 =C2=A020:=C2=A0 =C2=A0 =C2=A00x7ffca1163033 - BaseThrea=
dInitThunk<br>
=C2=A04:31.84=C2=A0 =C2=A021:=C2=A0 =C2=A0 =C2=A00x7ffca3a53690 - RtlUserTh=
readStart<br>
=C2=A04:31.84 warning: build failed, waiting for other jobs to finish...<br=
>
=C2=A04:31.95 error: build failed<br>
=C2=A04:32.06 mozmake.EXE[4]: *** [f:/mozilla-source/config/<a href=3D"http=
://rules.mk:1040" rel=3D"noreferrer noreferrer" target=3D"_blank">rules.mk:=
1040</a>: force-cargo-library-build] Error 101<br>
=C2=A04:32.06 mozmake.EXE[3]: *** [f:/mozilla-source/config/<a href=3D"http=
://recurse.mk:74" rel=3D"noreferrer noreferrer" target=3D"_blank">recurse.m=
k:74</a>: js/src/rust/target] Error 2<br>
=C2=A04:32.08 mozmake.EXE[2]: *** [f:/mozilla-source/config/<a href=3D"http=
://recurse.mk:34" rel=3D"noreferrer noreferrer" target=3D"_blank">recurse.m=
k:34</a>: compile] Error 2<br>
=C2=A04:32.09 mozmake.EXE[1]: *** [f:/mozilla-source/config/<a href=3D"http=
://rules.mk:424" rel=3D"noreferrer noreferrer" target=3D"_blank">rules.mk:4=
24</a>: default] Error 2<br>
=C2=A04:32.12 mozmake.EXE: *** [<a href=3D"http://client.mk:125" rel=3D"nor=
eferrer noreferrer" target=3D"_blank">client.mk:125</a>: build] Error 2<br>
=C2=A04:32.19 0 compiler warnings present.<br>
_______________________________________________<br>
dev-builds mailing list<br>
<a href=3D"mailto:dev-builds@lists.mozilla.org" target=3D"_blank" rel=3D"no=
referrer">dev-builds@lists.mozilla.org</a><br>
<a href=3D"https://lists.mozilla.org/listinfo/dev-builds" rel=3D"noreferrer=
 noreferrer" target=3D"_blank">https://lists.mozilla.org/listinfo/dev-build=
s</a><br>
</blockquote></div>

--000000000000b1642d057e40d952--

0
Bobby
12/30/2018 5:44:25 PM
Reply: