Failure to build B2G from build.sh for nexus S

Hi there,

I'm trying to build b2g for my nexus S, I followed the mozilla wiki.

the git cloning went well, when i run ./config.sh I can see the nexus S
option.

But when I type ./config.sh/ nexus-s

I get an error message :

[me@arch B2G]$ ./config.sh nexus-s
Traceback (most recent call last):
  File "./repo", line 738, in <module>
    main(sys.argv[1:])
  File "./repo", line 705, in main
    _Init(args)
  File "./repo", line 234, in _Init
    _CheckGitVersion()
  File "./repo", line 274, in _CheckGitVersion
    if not ver_str.startswith('git version '):
TypeError: startswith first arg must be bytes or a tuple of bytes, not str
Repo sync failed


So i'm stuck here and I don't really grasp where the problem comes from.
I use archlinux i686

Thanks for your help and the work you do on B2G !

Antoine
0
Antoine
4/9/2013 9:35:50 PM
mozilla.dev.b2g 4036 articles. 0 followers. Post Follow

0 Replies
1066 Views

Similar Articles

[PageSpeed] 23

Reply:

Similar Artilces:

Build B2G ubuntu 32bits error config.sh emulator-x86 and build.sh
I Have matter to generate build.sh B2G on Ubuntu 32bits. The config.sh x86 emulator-dyke good, but when I try to build.sh, occurs th= e following error Help me, please? [code] Install: out/host/linux-x86/bin/emulator-x86 target Generated: emulator64-arm <=3D external/qemu/qemu-monitor.hx target Generated: emulator64-arm <=3D external/qemu/qemu-options.hx host C: emulator64-arm <=3D external/qemu/audio/audio.c ERROR: prebuilts/tools/gcc-sdk/../../gcc/linux-x86/host/x86_64-linux-glibc2= ..7-4.6/bin/x86_64-linux-gcc only run on 64-bit linux > Build failed! < [...

Where are "b2g-bin" and Gaia's profile located in Pandaboard's B2G build?
Hi fellow citizens of the free software world, For the B2G desktop build, we can pass arguments to "b2g-bin" to run B2G with a specific resolution or to run specific apps. However I can't find either "b2g-bin" or the Gaia profile directory on the Pandaboard's B2G build. What can we do to get access to "b2G-bin" on the Pandaboard? Or is there any alternative way of passing arguments to B2G? Many thanks for reading, and much appreciated in advance for replying, Hugh ...

Getting build failure for B2G ARM emulator build
Hi, I am trying to build b2g emulator for ARM. Followed guide in below link: https://developer.mozilla.org/en-US/docs/Mozilla/Boot_to_Gecko/Preparing_for_your_first_B2G_build#Configuring_to_build_an_emulator when i do build ./build.sh -j1, build is failing with below error /bin/bash: ./xulrunner-sdk/bin/run-mozilla.sh: No such file or directory make[1]: *** [applications-data] Error 127 make[1]: Leaving directory `/u/prakot/emulator/B2G/gaia' make: *** [gaia/profile.tar.gz] Error 2 real 11m57.776s user 8m43.420s sys 1m25.890s > Build failed! < can i get s...

Trying to build B2G for nexus s 4g
I am able to build with the make-config-nexuss4g, make gonk, and make. I can then use make-flashonly-crespo4g to load B2G on my phone. It boots, however the touchscreen doesn't work. Here is a logcat of the bootup process. Anybody got any ideas? 1. - waiting for device - 2. --------- beginning of /dev/log/main 3. I/DEBUG ( 73): debuggerd: Mar 29 2012 15:47:50 4. --------- beginning of /dev/log/system 5. I/Vold ( 71): Vold 2.1 (the revenge) firing up 6. I/Netd ( 72): Netd 1.0 starting 7. D/Vold ( 71): Volume sdcard state changi...

Problem building B2G on fedora for nexus s
Hi, I'm having problem building B2G for nexus s on fedora OS. I first cloned B2G from git using git clone git://github.com/mozilla-b2g/B2G.git then next, i tried to configure it for nexus s using ./config.sh nexus-s this is where it crashes after hours and hours of downloading I've been trying this for weeks now, and have already tried it 5 times. Everytime it crashes, and i've to restart the process. This time the error that i got is : error: Exited sync due to fetch errors Repo sync failed b2g I'm not restarting it this time, hoping maybe there's a way to re...

Build error building B2G for Aries
Running: BRANCH=master ./config.sh aries ./build.sh I'm getting the following error when building B2G: ------ pull: /sbin/watchdogd -> ../../../backup-aries/root/sbin/watchdogd 10 files pulled. 0 files skipped. 1161 KB/s (2370098 bytes in 1.991s) Pulling files from ../../../backup-aries Invalid system backup - Wrong base version found: aries-eng 4.4.2 KOT49H eng.worker.20150721.152336 test-keys. Do this: 1. Delete backup-aries 2. Flash your device with KK based images from the vendor 3. Try building again > Build failed! < ------ For context, I...

B2G build creating "desktop" build
I'm building gecko on OSX 10.9.5 for a flame. My workflow is: ../config.sh flame-kk ../build.sh gecko ../flash.sh gecko The build succeeds yet the flame doesn't boot up after I flash. I noticed t= he build produces a 'b2g-bin' file dist/b2g. My understanding is this shoul= d only be produced for desktop builds. I believe the fact that this file is= produced is the source of the startup errors. My .userconfig is: export MOZ_PROFILING=3D1 export DEVICE_DEBUG=3D1 export GECKO_PATH=3D/Volumes/firefoxos/sandbox/mozilla/B2G/gecko Any help/hints are appreciated....

Build Error while building B2G for armani. Please Help Me
make: *** No rule to make target `out/target/product/armani/obj/STATIC_LIBRARIES/lib_driver_cmd_qcwcn_intermediates/export_includes', n eeded by `out/target/product/armani/obj/EXECUTABLES/hostapd_intermediates/import_includes'. Stop Manifest: https://github.com/b2g-armani/manifest/blob/master/armani.xml ...

VS Builds, and Builds, and Builds
Hello, Has anyone else had this problem?  After a while of developing, and I go to compile, VS takes forever to build and I have to end-task it.  It's definitely after I've been working for a while, then it finally has "had it" and just takes forever to build.  It's annoying as I know its not the machine (2.8 GHZ processor and 1GB RAM).  Has anyone else experienced this problem?  By the way, I do have SP1 installed. Also, after minimizing and switching around screens, when it does this, the building icon in the status bar doesn't show.  And, for more informati...

Cannot build B2G
--bcaec51718657c80c60502ed629f Content-Type: text/plain; charset=UTF-8 Hello, I am trying to build B2G project but it keeps on failing at the step ../config.sh emulator-jb I think my git repository has messed up. I have tried a lot of things. Some of them have been listed here: http://pastebin.com/af9sruAL I have been trying this for more than one or two weeks but without any success. Can someone please look at this and suggest what can I do to resolve this? -- Thanks and regards, Vivek. J. Joshi. --bcaec51718657c80c60502ed629f Content-Type: text/html; chars...

Facing build errors when building B2G configured as emulator-x86 on ubuntu 11.10.
Following is the terminal output as i see: >>>>>>>>>>>>>>>>>>>>>>>>>>>>>>>>>>>>>>>>>>>>>>>>>> >>>>>>>>>>>>>>>>>>>>>>>>>>>>>>>>>>>>>>>>>>> sbanerje@ubuntu:~/B2G$ ./build.sh -j1 including sdk/bash_completion/adb.bash /bin/bash: java: command not found /bin/bash: java: command not found /bin/bash: java: comman...

Facing build errors when building B2G configured as emulator-x86 on ubuntu 11.10. #2
sbanerje@ubuntu:~/B2G$ ./build.sh -j1 including sdk/bash_completion/adb.bash /bin/bash: java: command not found /bin/bash: java: command not found /bin/bash: java: command not found /bin/bash: java: command not found =3D=3D=3D=3D=3D=3D=3D=3D=3D=3D=3D=3D=3D=3D=3D=3D=3D=3D=3D=3D=3D=3D=3D=3D=3D= =3D=3D=3D=3D=3D=3D=3D=3D=3D=3D=3D=3D=3D=3D=3D=3D=3D=3D=3D PLATFORM_VERSION_CODENAME=3DAOSP PLATFORM_VERSION=3D4.0.4.0.4.0.4 TARGET_PRODUCT=3Dfull_x86 TARGET_BUILD_VARIANT=3Deng TARGET_BUILD_TYPE=3Drelease TARGET_BUILD_APPS=3D TARGET_ARCH=3Dx86 TARGET_ARCH_VARIANT=3Dx86-atom HOST_ARCH=3Dx...

Building b2g for Keon
So I wanted to flash a custom B2G build to the Keon, so I did: ../config.sh keon ../build.sh And then I got: make -C kernel O=../out/target/product/keon/obj/KERNEL_OBJ ARCH=arm CROSS_COMPILE=arm-eabi- headers_install CHK include/linux/version.h INSTALL include/linux/netfilter (69 files) INSTALL include/linux/netfilter_ipv4 (14 files) INSTALL include/linux/netfilter_ipv6 (11 files) make -C kernel O=../out/target/product/keon/obj/KERNEL_OBJ ARCH=arm CROSS_COMPILE=arm-eabi- GEN /Users/janjongboom/repos/B2G/out/target/product/keon/obj/KERNEL_OBJ/Makefile scripts/...

Some troubles after building B2G.
--047d7bfcec50b14eb704ffe31406 Content-Type: text/plain; charset=UTF-8 Hi, I have build a new build for my Flame device and after the splash screen of T-Mobile the screen goes off, despite I still have adb. This is the output of adb logcat: http://pastebin.com/4BcqGfhZ Would you know what is wrong with it? I have tried to remove /out/, but building it again doesn't seem to fix it. Would you have any suggestion? Thanks! --047d7bfcec50b14eb704ffe31406 Content-Type: text/html; charset=UTF-8 <div dir="ltr"><div><div><div><div>...

Web resources about - Failure to build B2G from build.sh for nexus S - mozilla.dev.b2g

Respiratory failure - Wikipedia, the free encyclopedia
Respiratory failure is inadequate gas exchange by the respiratory system , with the result that levels of arterial oxygen, carbon dioxide or ...

WSJ investigation reveals Takata may have hidden testing failures
Filed under: Government/Legal , Recalls , Safety , Japan Internal Takata documents reveal that from 2000 to 2010, US engineers raised concerns ...

Larwyn's Linx: Failure of Intelligence How Liberals Cause ISIS Terror Attacks
Send us tips ! Bloggers: install a Larwyn's Linx widget . Get real-time news, 24/7, at BadBlue . Nation Failure of Intelligence How Liberals ...

Star: Brad Pitt ‘can’t stop cringing’ & ‘feels humiliated’ over By the Sea’s failure
... interesting because I do love all things Brangelina, and infuriating because OMG, the media coverage does not match the total failure of the ...

Thoughts on the inter-relatedness of software architecture, infrastructure, and process. -or- Three tasty ...
... changes, you’ve just exchanged one headache for n headaches. (more on that here… ) — Special Bonus: Free Recipes for Software Project Failure! ...

Failures in close have Bears seeing red but not the end zone
The Bears ranked 28th in red-zone touchdowns before Sunday, and they settled for too many field goals again in a loss to the Denver Broncos. ...

This week in the war on voters: Alabama settles with DOJ over failure to follow 'Motor Voter' law
... rights : In memorandums of understanding, the U.S. Department of Justice and Alabama officials reached a settlement over the the state’s failure ...

A Powerful Strategy For Turning Failure Into Success
If we seek to growas people and as professionalswe pursue desired ends. We challenge ourselves with the goals we set. Those inspire us, push ...

IMPENDING FAILURE? Fate of ObamaCare co-ops unclear after half collapse
IMPENDING FAILURE? Fate of ObamaCare co-ops unclear after half collapse

Report: Mechanical Failure Caused Maine Ski Lift Accident
Maine report confirms mechanical failure caused Sugarloaf ski lift accident that hurt 7

Resources last updated: 11/29/2015 9:12:24 AM