asp.net (VB) error message: "The compiler failed with error code 1"

I'm running a asp.net (VB.NET) on one my servers, and when I try and open it up I'm getting the following error message:

Server Error in '/' Application.

Compilation Error

Description: An error occurred during the compilation of a resource required to service this request. Please review the following specific error details and modify your source code appropriately.

Compiler Error Message: The compiler failed with error code 1.



C:\WINNT\system32> "C:\WINNT\Microsoft.NET\Framework\v2.0.50727\vbc.exe" /t:library /utf8output /R:"C:\WINNT\assembly\GAC_MSIL\System.Web.Extensions\1.0.61025.0__31bf3856ad364e35\System.Web.Extensions.dll" /R:"C:\WINNT\assembly\GAC_MSIL\System.Web.Services\2.0.0.0__b03f5f7f11d50a3a\System.Web.Services.dll" /R:"C:\WINNT\assembly\GAC_MSIL\System.Drawing\2.0.0.0__b03f5f7f11d50a3a\System.Drawing.dll" /R:"C:\WINNT\assembly\GAC_MSIL\System\2.0.0.0__b77a5c561934e089\System.dll" /R:"C:\WINNT\assembly\GAC_MSIL\System.Configuration\2.0.0.0__b03f5f7f11d50a3a\System.Configuration.dll" /R:"C:\WINNT\assembly\GAC_MSIL\System.Web.Mobile\2.0.0.0__b03f5f7f11d50a3a\System.Web.Mobile.dll" /R:"C:\WINNT\assembly\GAC_32\System.Data\2.0.0.0__b77a5c561934e089\System.Data.dll" /R:"C:\WINNT\Microsoft.NET\Framework\v2.0.50727\Temporary ASP.NET Files\root\d9cd14f0\2b533f05\assembly\dl3\39f0f0f9\a0acc85a_f923c901\ItmsCommonLibrary.DLL" /R:"C:\WINNT\assembly\GAC_MSIL\System.Xml\2.0.0.0__b77a5c561934e089\System.Xml.dll" /R:"C:\WINNT\Microsoft.NET\Framework\v2.0.50727\Temporary ASP.NET Files\root\d9cd14f0\2b533f05\assembly\dl3\b8a93414\402657e6_4c81c901\ItmsBusinessLayer.DLL" /R:"C:\WINNT\assembly\GAC_32\System.EnterpriseServices\2.0.0.0__b03f5f7f11d50a3a\System.EnterpriseServices.dll" /R:"C:\WINNT\assembly\GAC_MSIL\System.Web.Extensions.Design\1.0.61025.0__31bf3856ad364e35\System.Web.Extensions.Design.dll" /R:"C:\WINNT\Microsoft.NET\Framework\v2.0.50727\Temporary ASP.NET Files\root\d9cd14f0\2b533f05\assembly\dl3\516b394b\002a4c29_1211c801\AjaxControlToolkit.DLL" /R:"C:\WINNT\assembly\GAC_MSIL\System.Design\2.0.0.0__b03f5f7f11d50a3a\System.Design.dll" /R:"C:\WINNT\Microsoft.NET\Framework\v2.0.50727\Temporary ASP.NET Files\root\d9cd14f0\2b533f05\assembly\dl3\f98f4a1d\48f0dfe5_4c81c901\RealWorld.Grids.DLL" /R:"C:\WINNT\assembly\GAC_32\System.Web\2.0.0.0__b03f5f7f11d50a3a\System.Web.dll" /R:"C:\WINNT\Microsoft.NET\Framework\v2.0.50727\Temporary ASP.NET Files\root\d9cd14f0\2b533f05\assembly\dl3\748b55ab\4c1a6ee7_4c81c901\ItmsWebApp.DLL" /R:"C:\WINNT\assembly\GAC_32\Oracle.DataAccess\2.102.2.20__89b483f429c47342\Oracle.DataAccess.dll" /out:"C:\WINNT\Microsoft.NET\Framework\v2.0.50727\Temporary ASP.NET Files\root\d9cd14f0\2b533f05\App_Web_wcmainmenu.ascx.2905fb83.w38v6hqy.dll" /D:DEBUG=1 /debug+ /define:_MYTYPE=\"Web\" /imports:Microsoft.VisualBasic,System,System.Collections,System.Collections.Specialized,System.Configuration,System.Text,System.Text.RegularExpressions,System.Web,System.Web.Caching,System.Web.SessionState,System.Web.Security,System.Web.Profile,System.Web.UI,System.Web.UI.WebControls,System.Web.UI.WebControls.WebParts,System.Web.UI.HtmlControls  "C:\WINNT\Microsoft.NET\Framework\v2.0.50727\Temporary ASP.NET Files\root\d9cd14f0\2b533f05\App_Web_wcmainmenu.ascx.2905fb83.w38v6hqy.0.vb" "C:\WINNT\Microsoft.NET\Framework\v2.0.50727\Temporary ASP.NET Files\root\d9cd14f0\2b533f05\App_Web_wcmainmenu.ascx.2905fb83.w38v6hqy.1.vb"


Microsoft (R) Visual Basic Compiler version 8.0.50727.1433
for Microsoft (R) .NET Framework version 2.0.50727.1433
Copyright (c) Microsoft Corporation.  All rights reserved.

Now, I'm running this site in under 2 seperate locations on the server and the one site works fine.

Its setup under 2 websites under IIS, one site works fine and the other site gives me this error. Any ideas on what could be causing this on my one site? The site is .NET 2.0 and developed in VS 2005. 

 

0
IGotYourDotNet
1/28/2009 1:39:59 PM
asp.net.installation-setup 5668 articles. 1 followers. Follow

0 Replies
1021 Views

Similar Articles

[PageSpeed] 51

Reply:

Similar Artilces:

external component has thrown an exception" Compiler Error Message: The compiler failed with error code 1.
I seriously frustrated i am struggling to resolve this problem. I not sure what the problem is at all. Can someone please help. I keep getting the following "external component has thrown an exception" Compiler Error Message: The compiler failed with error code 1. C:\Program Files\Microsoft Visual Studio 8\Common7\IDE> "c:\WINDOWS\Microsoft.NET\Framework\v2.0.50727\csc.exe" /t:library /utf8output /R:"C:\WINDOWS\assembly\GAC_MSIL\System.Configuration\2.0.0.0__b03f5f7f11d50a3a\System.Configuration.dll" /R:"C:\WINDOWS\assembly\GAC_MSIL\System\2.0...

I couldn't install Visual Studio.Net 2003, while installing an error message "Internal Error is comming"
[DMW: deleted due to the length of the log, and what follows is what's important][09/29/05,14:28:23] Visual Studio .NET Enterprise Architect 2003 - English: ***ERRORLOG EVENT*** : ACTION FAILURE: Action ended 14:28:23: CADpc.D0DF3458_A845_11D3_8D0A_0050046416B9. Return value 3. See MSI log for details.[09/29/05,14:28:23] Visual Studio .NET Enterprise Architect 2003 - English: ***ERRORLOG EVENT*** : ACTION FAILURE: Action ended 14:28:23: INSTALL. Return value 3. See MSI log for details.[09/29/05,14:28:30] Visual Studio .NET Enterprise Architect 2003 - English: MsiInstallProduct return cod...

Getting compilation error "The compiler failed with error code 128"
Hi All - I am getting a compilation error when I contact AXMS page , below is the error which i got . Compilation Error Description: An error occurred during the compilation of a resource required to service this request. Please review the following specific error details and modify your source code appropriately. Compiler Error Message: The compiler failed with error code 128. when i retstart the system its working fine , but its happening now and then so could not able to predict whats going on .  kindly guide me to eluminate this problem .  Thanks, Jeyaprakash. Tr...

Retrograding httpHandler from .NET 2.0 to 1.1, get "Parser Error Message: Could not create type" message
Hi there,I have written a httpHandler using VS2005 and .NET 2.0 that builds and works fine.However, I am now having to convert it to .NET 1.1, which I hoped would just be a case of changing the runtime used by the web app (as in running the 1.1 version of aspnet_regiis, with a "-s" switch pointing at my web apps folder). After doing this though (and fixing a few minor differences with web.config), if I then navigate to my handler I get the following error message:Server Error in '/Path/To/MyWebApp' Application.Parser ErrorDescription: An error occurred during the parsing of...

Developed C#.net WebService 1.1 for Client C#.net 1.1. Getting error "Server was unable to process the Request" Pls Help
Hi., I developed Microsoft C#.net Web Services2003 for the Client Application C#.net 2003. When it runs in 5 machines it gives good performance and has no errors. But if i run the same application in about 80 client machines. Getting error "Server was unable to process the request". I use Sql Server 2005 as my database. I get error even when i login at a time for about 25 users. Tried modifying machine.config too. But went unsuccessful. Live Server is 2003 using IIS 6.0 I use very expensive data handling.  Its very urgent pls help. Have to post in Live Server. Thank u., ...

Create setup pakage: Parser Error: Line 1: <%@ Master Language="VB" CodeFile="MasterPage.master.vb" Inherits="MasterPage"%>
Hello, I got stuck. My application is working find in the vs2005 development as I create the master page and content page. I can view my content page in the vs 2005 development without any error. I create my new web setup project (WebSetup1) as I add: 1. Primary ouput and content files 2. WebApplication1.dll 3. WebApplication1.pdp 4. WebApplication1.xml Then I build webSetup1 project. Then I install my webSetup1 to IIS server choosing Virtual Directory: WebSetup1 Installation sucessful But when I browse my defalut page from IIS I get the error: Parser Error Description: An ...

Migration from .net 1.1 to .net 2.0 and deployed in server: error "Server Application Unavilable"
Hi, I have upgraded one .net 1.1 application to .net 2.0. though locally the application is running fine, when deployed in the server it is giving the following error : Server Application Unavailable The web application you are attempting to access on this web server is currently unavailable.  Please hit the "Refresh" button in your web browser to retry your request. Administrator Note: An error message detailing the cause of this specific request failure can be found in the application event log of the web server. Please review this log entry to discover what caused thi...

error "Failed to get datetime data" using dw.net 1.0.1
Hello, My situation: I have a vs2005 project with dw.net version 1.0.1 (build 5502), database is asa10. When my regional settings are Dutch(Belgium) I have no problems at all. When the settings are Italian(Italy) I get a "Failed to get datetime" error when I retrieve when my data contains dates. When the date fields are not filled in then I do not get the error. A date of '2008-1-1 08:00:00' also gives errors. When I try to retrieve the same data in the datawindow painter I also get no error. Can anyone help me? Greetings, Mich=E8le DW.net 2.5 is now th...

.NET Error Message "Server Error in '/' Application."
I continue to get this error message randomly for several .NET applications and I'm trying to determine if this issue is "Permissions" or "Application Configuration" related.  What are the necessary NTFS security groups and rights that should be applied to the file directories?  Or what is the resolution to resolving this complex problem? HELP! moblack29   The first step is posting the full error message. JeffPlease: Don't forget to click "Mark as Answer" on the post that helped you. That way future readers will know which post solved your issue....

"Error loading XML file :\windows\microsoft.net\framework\v1.0.3705"...does this mean v.1.1 code trying to run in a v.1.0 app?
I uploaded some new files into my existing third-party hosted site, including a .DLL into \BIN\, which is running AS.NET v.1.0. I got the following error message when browsing to one of the pages using the code in the namespace defined in the DLL: Error loading XML file c:\windows\microsoft.net\framework\v1.0.3705\Config\machine.config Request for the permission of type System.Security.Permissions.StrongNameIdentityPermission, mscorlib, Version=1.0.3300.0, Culture=neutral, PublicKeyToken=b77a5c561934e089 failed. (c:\windows\microsoft.net\framework\v1.0.3705\Config\machine.config) ...

GW7Sp2 "Webaccess Install failed " error: Setup failed to run installation:
GW7Sp2 "Webaccess Install failed " error: Setup failed to run installation: The remote procedure call failed. I am running the novell client 4.91sp2 and the firewall is disabled on my XP machine. I have turned off antivirus and still cannot get it to work. Later I tried to run the Hot Fix for the GWIA gw702hp1gwia_reva.exe and I cannot get the install to work following the instructions for download and extraction and trying to run it from CMD install /copyonly. If anyone has worked through this I would really appreciate their solution. Harrel Hi, Harrelc ...

Re: SMTP "authentication failed", Message "UGFzc3dvcmQ6" and error code 535
> {quote:title=Kevin Killion wrote:}{quote} > I'm trying to use a TIdSMTP to send an email message, but when issuing the "Send" I'm getting a EIdSMTPReplyError exception, with: > Message: authentication failed: UGFzc3dvcmQ6 > ErrorCode: 535 > > Needless to say, neither the Message nor that ErrorCode tell me much about what went wrong! You stand a better chance of getting answers about Indy components if you ask in the WinSock group instead. Members of the Indy team (at least one or two, anyway) check in there pretty often. (Forums->...

"Compilation Error Compiler Error Message: BC30002: Type "'ws.Email' is not defined." after webservice request.
Hi,  I created a Webservice, which sends emails of a filled form. Offline I have no problems to get it to work, but when I put my website online I get "Compilation Error Compiler Error Message: BC30002: Type "'ws.Email'  is not defined." It seems it can't find the webservice anymore, although I added the webreference (which worked fine) before I put the website online (with dir App_WebReferences -> ws -> Email.wsdl,...)  This is the code which requests the webrequest:Dim SendEmail As New ws.Email() SendEmail.Send_Mail(code, 2, TextB...

Mail pseudo-error
In a brand new XP system with Netscape 7.1, sending mail (not news) results in the "delivering mail" window, followed soon after by a window headed "Send Message Error" with text "Sending of Message Failed" followed by an indication that the SMTP server refused to handle it. BUT THE MESSAGE *IS* sent successfully! The "delivering message" window ends up saying "Mail sent successfully", with the progress bar still moving because the error message is still there. Closing the error message window closes the "delivering" w...

SQL statement failed: (-305) I/O error Fatal error: A disk read from file "SomeDatabase.db" failed with error code: (38)
SQL Anywhere 10.0.1.3831 E. 2009-09-11 21:55:41. SQL statement failed: (-305) I/O error Fatal error: A disk read from file "D:\FHMSL\iFHMS\Data\Feedlot111.db" failed with error code: (38) -- transaction rolled back E. 2009-09-11 21:55:41. Error while executing hook procedure sp_hook_dbmlsync_end. Received this error while running a proc during sync. Tried to validate the db in Sybase Central resulting in the same error. I saw the post at http://groups.google.com/group/sybase.public.sqlanywhere.general/browse_thread/thread/b5d958904160e576?fwc=1 and am wondering if th...