Parser Error Message: Could not load file or assembly 'CrystalDecisions.ReportAppServer.ClientDoc, Version=10.2.3600.0, Culture=neutral, PublicKeyToken=692fbea5521e1304' or one of its dependencies. Th

  

Server Error in '/AccCardEPFS2' Application.

Configuration Error

Description: An error occurred during the processing of a configuration file required to service this request. Please review the specific error details below and modify your configuration file appropriately.

Parser Error Message: Could not load file or assembly 'CrystalDecisions.ReportAppServer.ClientDoc, Version=10.2.3600.0, Culture=neutral, PublicKeyToken=692fbea5521e1304' or one of its dependencies. The system cannot find the file specified.

Source Error:

Line 39: 				<add assembly="CrystalDecisions.Shared, Version=10.2.3600.0, Culture=neutral, PublicKeyToken=692fbea5521e1304"/>
Line 40: 				<add assembly="CrystalDecisions.Web, Version=10.2.3600.0, Culture=neutral, PublicKeyToken=692fbea5521e1304"/>
Line 41: 				<add assembly="CrystalDecisions.ReportAppServer.ClientDoc, Version=10.2.3600.0, Culture=neutral, PublicKeyToken=692fbea5521e1304"/>
Line 42: 				<add assembly="CrystalDecisions.Enterprise.Framework, Version=10.2.3600.0, Culture=neutral, PublicKeyToken=692fbea5521e1304"/>
Line 43: 				<add assembly="CrystalDecisions.Enterprise.InfoStore, Version=10.2.3600.0, Culture=neutral, PublicKeyToken=692fbea5521e1304"/></assemblies>

Source File: C:\Inetpub\wwwroot\acccardepfs2\web.config    Line: 41

Assembly Load Trace: The following information can be helpful to determine why the assembly 'CrystalDecisions.ReportAppServer.ClientDoc, Version=10.2.3600.0, Culture=neutral, PublicKeyToken=692fbea5521e1304' could not be loaded.

WRN: Assembly binding logging is turned OFF.
To enable assembly bind failure logging, set the registry value [HKLM\Software\Microsoft\Fusion!EnableLog] (DWORD) to 1.
Note: There is some performance penalty associated with assembly bind failure logging.
To turn this feature off, remove the registry value [HKLM\Software\Microsoft\Fusion!EnableLog].


Version Information: Microsoft .NET Framework Version:2.0.50727.1433; ASP.NET Version:2.0.50727.1433

 

Anyone know how this can get fixed ? It works perfectly on my Local Machine, but once uploaded to the Server, Then this error occurs.

 

Any help would be greatly appreciated.

Thanks

0
AxleWack
3/27/2009 1:17:04 PM
asp.net.getting-started 91979 articles. 3 followers. Follow

3 Replies
1588 Views

Similar Articles

[PageSpeed] 45

Hi,


Remove That Line and Check The Application

Or
 U have Install The Merge Module of Crystal report on Server

or

As Warning Message  Shows U :-

/*
 turned OFF.
To enable assembly bind failure logging, set the registry value [HKLM\Software\Microsoft\Fusion!EnableLog] (DWORD) to 1.
Note: There is some performance penalty associated with assembly bind failure logging.
To turn this feature off, remove the registry value [HKLM\Software\Microsoft\Fusion!EnableLog].
*/


Hope It helps


Thanks
Avinash Tiwari

Remember to click “Mark as Answer” on the post, if it helps you.
0
qwe123kids
3/27/2009 2:40:45 PM

 It looks like you need to deploy the Crystal Reports .NET components to the web server.

Hope it helps.


KAMMIE
Don't forget to Mark as Answer on the post that helped you. It encourages them to share their knowledge, and it helps others to easily identify the solution.
0
kammie
3/27/2009 2:52:28 PM

Hi,

This is the error I am getting now, and I cant seem to find ANY help on it at all?? Any Ideas?

 

Server Error in '/AccCardEPFS2' Application.

Error in File C:\WINDOWS\TEMP\Recon_Summary1_1 {3BFFC453-6046-4149-A41D-D83F260007A0}.rpt:
Access to report file denied. Another program may be using it.

Description: An unhandled exception occurred during the execution of the current web request. Please review the stack trace for more information about the error and where it originated in the code.

Exception Details: System.Runtime.InteropServices.COMException: Error in File C:\WINDOWS\TEMP\Recon_Summary1_1 {3BFFC453-6046-4149-A41D-D83F260007A0}.rpt:
Access to report file denied. Another program may be using it.

Source Error:

Line 17:         Dim strReportPath = "\\Servername\Directory\Recon_Summary1_1.rpt"
Line 18:         Dim CR As New ReportDocument
Line 19:         CR.Load(strReportPath)
Line 20:         '
Line 21:         ' Declare the parameter related objects.

Source File: C:\Inetpub\wwwroot\AccCardEPFS2\Recon_Summaries.aspx    Line: 19

Stack Trace:

[COMException (0x80000220): Error in File C:\WINDOWS\TEMP\Recon_Summary1_1 {3BFFC453-6046-4149-A41D-D83F260007A0}.rpt:
Access to report file denied. Another program may be using it.]
   CrystalDecisions.ReportAppServer.ClientDoc.ReportClientDocumentClass.Open(Object& DocumentPath, Int32 Options) +0
   CrystalDecisions.ReportAppServer.ReportClientDocumentWrapper.Open(Object& DocumentPath, Int32 Options) +87
   CrystalDecisions.ReportAppServer.ReportClientDocumentWrapper.EnsureDocumentIsOpened() +279

[Exception: Load report failed.]
   CrystalDecisions.ReportAppServer.ReportClientDocumentWrapper.EnsureDocumentIsOpened() +341
   CrystalDecisions.CrystalReports.Engine.ReportDocument.Load(String filename, OpenReportMethod openMethod, Int16 parentJob) +869
   CrystalDecisions.CrystalReports.Engine.ReportDocument.Load(String filename) +73
   ASP.recon_summaries_aspx.Page_Load(Object sender, EventArgs e) in C:\Inetpub\wwwroot\AccCardEPFS2\Recon_Summaries.aspx:19
   System.Web.Util.CalliHelper.EventArgFunctionCaller(IntPtr fp, Object o, Object t, EventArgs e) +15
   System.Web.Util.CalliEventHandlerDelegateProxy.Callback(Object sender, EventArgs e) +33
   System.Web.UI.Control.OnLoad(EventArgs e) +99
   System.Web.UI.Control.LoadRecursive() +47
   System.Web.UI.Page.ProcessRequestMain(Boolean includeStagesBeforeAsyncPoint, Boolean includeStagesAfterAsyncPoint) +1436


Version Information: Microsoft .NET Framework Version:2.0.50727.1433; ASP.NET Version:2.0.50727.1433

0
AxleWack
3/30/2009 7:20:11 AM
Reply:

Similar Artilces:

Could not load file or assembly 'CrystalDecisions.Web, Version=10.2.3600.0, Culture=neutral, PublicKeyToken=692fbea5521e1304' or one of its dependencies. The system cannot find the file specified.
Hi,  Ima using Crystal Reports for Visual Studio .NET 2005 Could not load file or assembly 'CrystalDecisions.Web, Version=10.2.3600.0, Culture=neutral, PublicKeyToken=692fbea5521e1304' or one of its dependencies. The system cannot find the file specified.I am getting this error after I deploy the application. Then I installed Crystal Reports for Visual Studio .NET 2005 - Service Pack 1 (Updated Nov. 2007) Merge Modules for Crystal Reports for Visual Studio .NET 2005 This file contains the latest merge modules required for deploying .NET applications using Crystal Reports ...

Could not load file or assembly 'CrystalDecisions.Web, Version=10.2.3600.0, Culture=neutral, PublicKeyToken=692fbea5521e1304'
Hi,   I got this error after I deploy in server.   Description: An error occurred during the processing of a configuration file required to service this request. Please review the specific error details below and modify your configuration file appropriately. Parser Error Message: Could not load file or assembly 'CrystalDecisions.Web, Version=10.2.3600.0, Culture=neutral, PublicKeyToken=692fbea5521e1304' or one of its dependencies. The system cannot find the file specified.Source Error: Line 57: <add verb="*" path="*_AppService....

Why do I get this error: "Could not load file or assembly 'System.Web.Extensions, Version=1.0.61025.0, Culture=neutral, PublicKeyToken=31bf3856ad364e35' or one of its dependencies. The system cannot f
I downloaded a reputed sample project and cant get it started because I am getting this error: Error 2 Could not load file or assembly 'System.Web.Extensions, Version=1.0.61025.0, Culture=neutral, PublicKeyToken=31bf3856ad364e35' or one of its dependencies. The system cannot find the file specified. D:\bills system\Bills Desktop\test\Dashboard\src\Dashboard\web.config 46  What can I do?  You need to install AJAX extensions for asp.net 2.0. You can get it here:http://www.asp.net/ajax/ Which version of Visual Studio are you using? If you are not us...

Could not load file or assembly 'System.Core, Version=2.0.0.0, Culture=neutral, PublicKeyToken=b77a5c561934e089' or one of its dependencies. The system cannot find the file specified
 Hi, I am using Jasper.. I downloaded JASPER and the sample code from http://www.microsoft.com/downloads/details.aspx?FamilyId=471BB3AC-B31A-49CD-A567-F2E286715C8F&displaylang=en but when  i try to run Samples.. I get the error :  Could not load file or assembly 'System.Core, Version=2.0.0.0, Culture=neutral, PublicKeyToken=b77a5c561934e089' or one of its dependencies. The system cannot find the file specified i can find only System,Core under 3.5 version. I tried running the project from VS2005 and from VS2008.. still the problem persists....

Could not load file or assembly 'System.Web.Extensions, Version=1.0.61025.0, Culture=neutral, PublicKeyToken=31bf3856ad364e35' or one of its dependencies. The system cannot find the file specified. #2
Hi, i copied the solution folder   and put this folder to another  computer and i try to run it show the error message " Could not load file or assembly 'System.Web.Extensions, Version=1.0.61025.0, Culture=neutral, PublicKeyToken=31bf3856ad364e35' or one of its dependencies. The system cannot find the file specified." Please guide me very urgent.Regards,Kannandesikan You need to install the ASP.NET AJAX extensions on the web server. ...

Error 25 Could not load file or assembly 'Microsoft.Web.Extensions, Version=1.0.61025.0, Culture=neutral, PublicKeyToken=31bf3856ad364e35' or one of its dependencies. The system cannot find the file s
Hi there,   I am just trying to learn AJAX at the moment and have run into a problem. I have copied over the example for cascading dropdowns and this is where I have the above error.The error occurs in the web.config file on this line <add assembly="Microsoft.Web.Extensions, Version=1.0.61025.0, Culture=neutral, PublicKeyToken=31bf3856ad364e35"/>  Can anyone advise what I need to change? The sample is for old ajax version. you need to copy latest ASP.NET AJAX web.config to your projects web.config below is my cascading code for new version for you  ASPX &l...

Why I get the following error sometimes from aspx pages. "File or assembly name 'nrg8uw5e, Version=0.0.0.0, Culture=neutral, PublicKeyToken=null', or one of its dependencies, was not found."
Hi , Can somebody suggest why I sometimes get 'File or assembly not found ' exception when I make changes in the .aspx file. Is it a bug in the whidbey?   Exception: Exception Type: System.IO.FileNotFoundExceptionMessage: File or assembly name 'nrg8uw5e, Version=0.0.0.0, Culture=neutral, PublicKeyToken=null', or one of its dependencies, was not found. StackTrace Information*********************************************at ASP.Header_aspx.__BuildControlTree(Header_aspx __ctrl)at ASP.Header_aspx.FrameworkInitialize() in c:\WINNT\Microsoft.NET\Framework\v2.0.40...

2008-09-24 16:32:38
Dear all     i spend my whole working day just to look at this and i still get the error messsage above here how it goes     The Problem     i have created a simple application that queries an oracle live database.... and my objective is to move it over to then development server....    when i tried to run from the development server it doesn't seem to work at all and i get following error message 2008-09-24 16:32:38 - (SQL_Ecard:GetECardTemplate) Could not load file or assembly 'Oracle.DataAccess, Version=10.2.0.100, ...

Could not load file or assembly 'AjaxControlToolkit, Version=1.0.10618.0, Culture=neutral, PublicKeyToken=28f01b0e84b6d53e' or one of its dependencies. The located assembly's manifest definition does
Hi, We just upgraded our application to .Net 3.5 from .Net 2.0. I updated the ajaxcontroltoolkit.dll to the corresponding version for .net 3.5 but we are getting the following error: "Could not load file or assembly 'AjaxControlToolkit, Version=1.0.10618.0, Culture=neutral, PublicKeyToken=28f01b0e84b6d53e' or one of its dependencies. The located assembly's manifest definition does not match the assembly reference. (Exception from HRESULT: 0x80131040)"  I tried to work around this using bindingredirect as following, but this did not solve the problem as I am stil...

Could not load file or assembly 'App_Web_zdfvephf, Version=0.0.0.0, Culture=neutral, PublicKeyToken=null' or one of its dependencies. The system cannot find the file specified.
 When  i tried  to access  my home page  it  shows the following  Error Could not load file or assembly 'App_Web_zdfvephf, Version=0.0.0.0, Culture=neutral, PublicKeyToken=null' or one of its dependencies. The system cannot find the file specified. Try to Find your project folder from this location, Close your Visual Studio and delete it, and restart your visual studio and then rebuild. C:\WINDOWS\Microsoft.NET\Framework\v2.0.50727\Temporary ASP.NET Files Hope you are Using ASP.NET v. 2.0. Hope this Helps,-Deepak - DeepakDon&...

File or assembly name 'System.Configuration, Version=2.0.3600.0, Culture=neutral, PublicKeyToken=b03f5f7f11d50a3a', or one of its dependencies, was not found.
I'm trying to move a working copy of TimeTracker to a different server. It is a W2K3 server running IIS 6 with the .NET framework 2.0 beta 2 and SQL Server 2005 beta 2 installed and configured. I copied over the files, opened the project in VS.NET 2005 and built it. It says that it built correctly, but when I try to open the Default.aspx, I get the following error. The site is configured to use the .NET framework 2.0. It is a virtual directory. File or assembly name 'System.Configuration, Version=2.0.3600.0, Culture=neutral, PublicKeyToken=b03f5f7f11d50a3a', or one of its depen...

Could not load file or assembly 'System.Web.Extensions, Version=3.5.0.0, Culture=neutral, PublicKeyToken=31bf3856ad364e35' or one of its dependencies. The located assembly's manifest definition does n
Hello All,If this is a repeat of posting that have been created, I sincerely apologize.  I have been looking for a solution for quite some time and although I have run across a lot of different posts offering solutions, nothing seems to be work.  Here is my dilemma:I have created a website with several pages using ASP.NET 2.0 and AJAX Extensions (including the AJAX Control Toolkit).  The pages run fine on my Development machine but on my IIS machine, I continue to recreate a Parser Error in regard to System.Web.Extensions.  Here is what I have done thus far: I have a...

coplilation error : Could not load file or assembly 'System.Web.Extensions, Version=3.5.0.0, Culture=neutral, PublicKeyToken=31bf3856ad364e35' or one of its dependencies. The system cannot find the fi
I have problem compiling my website on 2 machine(win 2003 server & windows vista). The problematics machines has these components installed: 1.Net framework 3.5 sp1 2.vs 2008 sp1 ver: 9.0.30729.1 sp 3.windows sdk for vs 2008 sp1 It works grate on 3 different machines (xp,2003) that has the same components installed and the Microsoft ASP.NET 3.5 Extension CTP. I can't install the Microsoft ASP.NET 3.5 Extension CTP because I already have the .net 3.5 sp1 installed. Here is my web.config ...

Unable to create type 'live:IDLoginStatus'. Could not load file or assembly 'System.Web.Extensions, Version=3.6.0.0, Culture=neutral, PublicKeyToken=31bf3856ad364e35' or one of its dependencies. The s
Hello,  I try to use a windowslive website in visual studio 2008 with framework 3.5 I have installed the framework 3.5 and i get following error although the site is working perfect in localhost: Unable to create type 'live:IDLoginStatus'. Could not load file or assembly 'System.Web.Extensions, Version=3.6.0.0, Culture=neutral, PublicKeyToken=31bf3856ad364e35' or one of its dependencies. The system cannot find the file specified.After this i check my gac and i manually (with configuration tool 2.0) installed 3.6 in my gac. I still get the same error. What am i doing ...

Web resources about - Parser Error Message: Could not load file or assembly 'CrystalDecisions.ReportAppServer.ClientDoc, Version=10.2.3600.0, Culture=neutral, PublicKeyToken=692fbea5521e1304' or one of its dependencies. Th - asp.net.getting-started

Resources last updated: 12/22/2015 4:28:11 AM